BDBM388992 4-(8-[3-chloro-4- (hydroxymethyl)phenyl]-5-{[(3R)-1- methylpiperidin-3- yl]methoxy}imidazo[1,2- c]pyrimidin-7-yl)benzonitrile::US10800779, Example 101::US11401272, Example 101::US9944647, Example 101
SMILES CN1CCC[C@@H](COc2nc(-c3ccc(cc3)C#N)c(-c3ccc(CO)c(Cl)c3)c3nccn23)C1
InChI Key InChIKey=JYOWURBBNPLEEV-LJQANCHMSA-N
Data  3 IC50
  Tab Delimited (TSV)   2D SDfile   Computed 3D by Vconf -m prep SDfile
Find this compound or compounds like it in BindingDB:
Activity Spreadsheet -- Enzyme Inhibition Constant Data from BindingDB
Found 3 hits for monomerid = 388992
TargetLysine-specific histone demethylase 1A(Homo sapiens (Human))
Incyte
US Patent
LigandPNGBDBM388992(4-(8-[3-chloro-4- (hydroxymethyl)phenyl]-5-{[(3R)-...)
Affinity DataIC50: <50nM. Assay description: LANCE LSD1/KDM1A demethylase assay-10 μL of 1 nM LSD-1 enzyme (ENZO BML-SE544-0050) in the assay buffer (50 mM Tris, pH 7.5, 0.01% Tween-20, 25 ...
Ligand InfoPC cidPC sid
In DepthDetails US Patent
TargetLysine-specific histone demethylase 1A(Homo sapiens (Human))
Incyte
US Patent
LigandPNGBDBM388992(4-(8-[3-chloro-4- (hydroxymethyl)phenyl]-5-{[(3R)-...)
Affinity DataIC50: <50nM. Assay description: LANCE LSD1/KDM1A demethylase assay 10 μL of 1 nM LSD-1 enzyme (ENZO BML-SE544-0050) in the assay buffer (50 mM Tris, pH 7.5, 0.01% Tween-20, 25 ...
Ligand InfoPC cidPC sid
In DepthDetails US Patent
TargetLysine-specific histone demethylase 1A(Homo sapiens (Human))
Incyte
US Patent
LigandPNGBDBM388992(4-(8-[3-chloro-4- (hydroxymethyl)phenyl]-5-{[(3R)-...)
Affinity DataIC50: <50nM. Assay description: LANCE LSD1/KDM1A demethylase assay—10 μL of 1 nM LSD-1 enzyme (ENZO BML-SE544-0050) in the assay buffer (50 mM Tris, pH 7.5, 0.01% Tween-20, 25 ...
Ligand InfoPC cidPC sid
In DepthDetails US Patent