BDBM38938 6,7-dimethoxy-2-[(4-phenyl-3,6-dihydro-2H-pyridin-1-yl)methyl]-1H-quinazolin-4-one::MLS000053305::SMR000067668::cid_2092851
SMILES COc1cc2nc(CN3CCC(=CC3)c3ccccc3)[nH]c(=O)c2cc1OC
InChI Key InChIKey=CKCSOMMBIPJYSG-UHFFFAOYSA-N
Data  4 IC50
  Tab Delimited (TSV)   2D SDfile   Computed 3D by Vconf -m prep SDfile
Find this compound or compounds like it in BindingDB:
Activity Spreadsheet -- Enzyme Inhibition Constant Data from BindingDB
Found 4 hits for monomerid = 38938
TargetIsoform 2 of Nuclear receptor ROR-alpha (Alpha-2)(Homo sapiens (Human))
The Scripps Research Institute Molecular Screening Center
Curated by PubChem BioAssay
LigandPNGBDBM38938(6,7-dimethoxy-2-[(4-phenyl-3,6-dihydro-2H-pyridin-...)
Affinity DataIC50:  1.48E+3nM. Assay description: Source (MLSCN Center Name): The Scripps Research Institute Molecular Screening Center Center Affiliation: The Scripps Research Institute, TSRI Assay ...
In DepthDetails PCBioAssay
TargetSteroidogenic factor 1(Homo sapiens (Human))
The Scripps Research Institute Molecular Screening Center
Curated by PubChem BioAssay
LigandPNGBDBM38938(6,7-dimethoxy-2-[(4-phenyl-3,6-dihydro-2H-pyridin-...)
Affinity DataIC50:  1.30E+3nM. Assay description: Source (MLSCN Center Name): The Scripps Research Institute Molecular Screening Center Center Affiliation: The Scripps Research Institute, TSRI Assay ...
In DepthDetails PCBioAssay
TargetIsoform 2 of Nuclear receptor ROR-alpha (Alpha-2)(Homo sapiens (Human))
The Scripps Research Institute Molecular Screening Center
Curated by PubChem BioAssay
LigandPNGBDBM38938(6,7-dimethoxy-2-[(4-phenyl-3,6-dihydro-2H-pyridin-...)
Affinity DataIC50:  2.89E+3nM. Assay description: Source (MLSCN Center Name): The Scripps Research Institute Molecular Screening Center Center Affiliation: The Scripps Research Institute, TSRI Assay ...
In DepthDetails PCBioAssay
TargetSteroidogenic factor 1(Homo sapiens (Human))
The Scripps Research Institute Molecular Screening Center
Curated by PubChem BioAssay
LigandPNGBDBM38938(6,7-dimethoxy-2-[(4-phenyl-3,6-dihydro-2H-pyridin-...)
Affinity DataIC50:  2.36E+3nM. Assay description: Source (MLSCN Center Name): The Scripps Research Institute Molecular Screening Center Center Affiliation: The Scripps Research Institute, TSRI Assay ...
In DepthDetails PCBioAssay