BDBM39125 3-chloranyl-1-(3,4-dichlorophenyl)-4-[(4-fluorophenyl)amino]pyrrole-2,5-dione::3-chloro-1-(3,4-dichlorophenyl)-4-(4-fluoroanilino)-3-pyrroline-2,5-quinone::3-chloro-1-(3,4-dichlorophenyl)-4-(4-fluoroanilino)pyrrole-2,5-dione::MLS-0067131.0001::cid_992333
SMILES Fc1ccc(cc1)N=C1C(Cl)C(=O)N(C1=O)c1ccc(Cl)c(Cl)c1
InChI Key InChIKey=ZSBZOQPTCBJQKU-UHFFFAOYSA-N
Data  1 IC50
  Tab Delimited (TSV)   2D SDfile   Computed 3D by Vconf -m prep SDfile
Find this compound or compounds like it in BindingDB:
Activity Spreadsheet -- Enzyme Inhibition Constant Data from BindingDB
Found 1 hit for monomerid = 39125
TargetBcl-2-related protein A1(Mus musculus (Mouse))
Sanford-Burnham Center For Chemical Genomics
Curated by PubChem BioAssay
LigandPNGBDBM39125(3-chloranyl-1-(3,4-dichlorophenyl)-4-[(4-fluorophe...)
Affinity DataIC50:  9.65E+4nM. Assay description: Sanford-Burnham Center for Chemical Genomics (SBCCG) Sanford-Burnham Medical Research Institute (San Diego, CA) NIH Molecular Libraries Screening Cen...
In DepthDetails PCBioAssay