BDBM391587 2,2,4-trimethyl-8-(6-methyl-7- oxo-6,7-dihydro-1H- pyrrolo[2,3-c]pyridin-4-yl)-6- (methylsulfonyl)-2H-1,4- benzoxazin-3(4H)-one::US10472358, Example 75::US10781209, Example 75::US11059821, Example 75::US11702416, Example 75::US9957268, Example 75
SMILES CN1C(=O)C(C)(C)Oc2c1cc(cc2-c1cn(C)c(=O)c2[nH]ccc12)S(C)(=O)=O
InChI Key InChIKey=VZSAMEOETVNDQH-UHFFFAOYSA-N
Data  10 IC50
  Tab Delimited (TSV)   2D SDfile   Computed 3D by Vconf -m prep SDfile
Find this compound or compounds like it in BindingDB:
Activity Spreadsheet -- Enzyme Inhibition Constant Data from BindingDB
Found 10 hits for monomerid = 391587
TargetBromodomain-containing protein 4 [42-168](Homo sapiens (Human))
Incyte
US Patent
LigandPNGBDBM391587(2,2,4-trimethyl-8-(6-methyl-7- oxo-6,7-dihydro-1H-...)
Affinity DataIC50: <100nM. Assay description: BRD4-BD1 and BRD4-BD2 assays were conducted in white 384-well polystyrene plate in a final volume of 40 μL for BD1 and 60 μL for BD2. Inhib...
In DepthDetails US Patent
TargetBromodomain-containing protein 4 [342-460](Homo sapiens (Human))
Incyte
US Patent
LigandPNGBDBM391587(2,2,4-trimethyl-8-(6-methyl-7- oxo-6,7-dihydro-1H-...)
Affinity DataIC50: <100nM. Assay description: BRD4-BD1 and BRD4-BD2 assays were conducted in white 384-well polystyrene plate in a final volume of 40 μL for BD1 and 60 μL for BD2. Inhib...
In DepthDetails US Patent
TargetBromodomain-containing protein 4 [75-147](Homo sapiens (Human))
Incyte
US Patent
LigandPNGBDBM391587(2,2,4-trimethyl-8-(6-methyl-7- oxo-6,7-dihydro-1H-...)
Affinity DataIC50: <100nM. Assay description: BRD4-BD1 and BRD4-BD2 assays were conducted in white 384-well polystyrene plate in a final volume of 40 μL for BD1 and 60 μL for BD2. Inhib...
In DepthDetails US Patent
TargetBromodomain-containing protein 4 [368-440](Homo sapiens (Human))
Incyte
US Patent
LigandPNGBDBM391587(2,2,4-trimethyl-8-(6-methyl-7- oxo-6,7-dihydro-1H-...)
Affinity DataIC50: <100nM. Assay description: BRD4-BD1 and BRD4-BD2 assays were conducted in white 384-well polystyrene plate in a final volume of 40 μL for BD1 and 60 μL for BD2. Inhib...
In DepthDetails US Patent
TargetBromodomain-containing protein 4 [349-460](Homo sapiens (Human))
Incyte
US Patent
LigandPNGBDBM391587(2,2,4-trimethyl-8-(6-methyl-7- oxo-6,7-dihydro-1H-...)
Affinity DataIC50: <100nM. Assay description: BRD4-BD1 and BRD4-BD2 assays were conducted in white 384-well polystyrene plate in a final volume of 40 μL for BD1 and 60 μL for BD2. Inhib...
In DepthDetails US Patent
TargetBromodomain-containing protein 4(Homo sapiens (Human))
Incyte
US Patent
LigandPNGBDBM391587(2,2,4-trimethyl-8-(6-methyl-7- oxo-6,7-dihydro-1H-...)
Affinity DataIC50: <100nM. Assay description: BRD4-BD1 and BRD4-BD2 assays were conducted in white 384-well polystyrene plate in a final volume of 40 μL for BD1 and 60 μL for BD2. Inhib...
In DepthDetails US Patent
TargetBromodomain-containing protein 4 [42-168](Homo sapiens (Human))
Incyte
US Patent
LigandPNGBDBM391587(2,2,4-trimethyl-8-(6-methyl-7- oxo-6,7-dihydro-1H-...)
Affinity DataIC50: <100nM. Assay description: BRD4-BD1 and BRD4-BD2 assays were conducted in white 384-well polystyrene plate in a final volume of 40 μL for BD1 and 60 μL for BD2. Inhib...
In DepthDetails US Patent
TargetBromodomain-containing protein 4 [342-460](Homo sapiens (Human))
Incyte
US Patent
LigandPNGBDBM391587(2,2,4-trimethyl-8-(6-methyl-7- oxo-6,7-dihydro-1H-...)
Affinity DataIC50: <100nM. Assay description: BRD4-BD1 and BRD4-BD2 assays were conducted in white 384-well polystyrene plate in a final volume of 40 μL for BD1 and 60 μL for BD2. Inhib...
In DepthDetails US Patent
TargetBromodomain-containing protein 4 [44-167](Homo sapiens (Human))
Incyte
US Patent
LigandPNGBDBM391587(2,2,4-trimethyl-8-(6-methyl-7- oxo-6,7-dihydro-1H-...)
Affinity DataIC50: <100nM. Assay description: BRD4-BD1 and BRD4-BD2 assays were conducted in white 384-well polystyrene plate in a final volume of 40 μL for BD1 and 60 μL for BD2. Inhib...
In DepthDetails US Patent
TargetBromodomain-containing protein 4(Homo sapiens (Human))
Incyte
US Patent
LigandPNGBDBM391587(2,2,4-trimethyl-8-(6-methyl-7- oxo-6,7-dihydro-1H-...)
Affinity DataIC50: <100nM. Assay description: BRD4-BD1 and BRD4-BD2 assays were conducted in white 384-well polystyrene plate in a final volume of 40 μL for BD1 and 60 μL for BD2. Inhib...
In DepthDetails US Patent