BDBM39160 3-(4-butyl-1-piperazinyl)-4-chloro-1-(3,4-dichlorophenyl)pyrrole-2,5-dione::3-(4-butylpiperazin-1-yl)-4-chloranyl-1-(3,4-dichlorophenyl)pyrrole-2,5-dione::3-(4-butylpiperazin-1-yl)-4-chloro-1-(3,4-dichlorophenyl)pyrrole-2,5-dione::3-(4-butylpiperazino)-4-chloro-1-(3,4-dichlorophenyl)-3-pyrroline-2,5-quinone::3-chloro-1-(3,4-dichlorophenyl)-4-(4-butylpiperazin-1-yl)-1H-pyrrole-2,5-dione::CHEMBL1272099::MLS-0090879.0001::cid_16654674
SMILES CCCCN1CCN(CC1)C1=C(Cl)C(=O)N(C1=O)c1ccc(Cl)c(Cl)c1
InChI Key InChIKey=KSGKTOITXHOGGI-UHFFFAOYSA-N
Data  4 IC50
  Tab Delimited (TSV)   2D SDfile   Computed 3D by Vconf -m prep SDfile
Find this compound or compounds like it in BindingDB:
Activity Spreadsheet -- Enzyme Inhibition Constant Data from BindingDB
Found 4 hits for monomerid = 39160
TargetBcl-2-related protein A1(Mus musculus (Mouse))
Sanford-Burnham Center For Chemical Genomics
Curated by PubChem BioAssay
LigandPNGBDBM39160(3-(4-butyl-1-piperazinyl)-4-chloro-1-(3,4-dichloro...)
Affinity DataIC50:  1.05E+4nM. Assay description: Data Source: Sanford-Burnham Center for Chemical Genomics (SBCCG) Source Affiliation: Sanford-Burnham Medical Research Institute (SBMRI, San Diego, C...
In DepthDetails PCBioAssay
TargetBcl-2-related protein A1(Homo sapiens (Human))
Human Biomolecular Research Institute
Curated by ChEMBL
LigandPNGBDBM39160(3-(4-butyl-1-piperazinyl)-4-chloro-1-(3,4-dichloro...)
Affinity DataIC50:  3.30E+3nM. Assay description: Inhibition of N-terminal FITC BH3 peptide binding to GST-tagged Bfl1 by time resolved-FRET assay
In DepthDetails ArticlePubMed
TargetBcl-2-related protein A1(Homo sapiens (Human))
Human Biomolecular Research Institute
Curated by ChEMBL
LigandPNGBDBM39160(3-(4-butyl-1-piperazinyl)-4-chloro-1-(3,4-dichloro...)
Affinity DataIC50:  1.05E+4nM. Assay description: Inhibition of N-terminal FITC BH3 peptide binding to GST-tagged Bfl1 by fluorescence polarization assay
In DepthDetails ArticlePubMed
TargetBcl-2-related protein A1(Mus musculus (Mouse))
Sanford-Burnham Center For Chemical Genomics
Curated by PubChem BioAssay
LigandPNGBDBM39160(3-(4-butyl-1-piperazinyl)-4-chloro-1-(3,4-dichloro...)
Affinity DataIC50:  3.28E+3nM. Assay description: Sanford-Burnham Center for Chemical Genomics (SBCCG) Sanford-Burnham Medical Research Institute (San Diego, CA) NIH Molecular Libraries Screening Cen...
In DepthDetails PCBioAssay