BDBM39163 3-chloranyl-1-(3,4-dichlorophenyl)-4-(3-methyl-4-phenyl-piperazin-1-yl)pyrrole-2,5-dione::3-chloro-1-(3,4-dichlorophenyl)-4-(3-methyl-4-phenyl-1-piperazinyl)pyrrole-2,5-dione::3-chloro-1-(3,4-dichlorophenyl)-4-(3-methyl-4-phenyl-piperazino)-3-pyrroline-2,5-quinone::3-chloro-1-(3,4-dichlorophenyl)-4-(3-methyl-4-phenylpiperazin-1-yl)pyrrole-2,5-dione::MLS-0090883.0001::cid_16654678
SMILES CC1CN(CCN1c1ccccc1)C1=C(Cl)C(=O)N(C1=O)c1ccc(Cl)c(Cl)c1
InChI Key InChIKey=FGRRRMBQNWFBNZ-UHFFFAOYSA-N
Data  1 IC50
  Tab Delimited (TSV)   2D SDfile   Computed 3D by Vconf -m prep SDfile
Find this compound or compounds like it in BindingDB:
Activity Spreadsheet -- Enzyme Inhibition Constant Data from BindingDB
Found 1 hit for monomerid = 39163
TargetBcl-2-related protein A1(Mus musculus (Mouse))
Sanford-Burnham Center For Chemical Genomics
Curated by PubChem BioAssay
LigandPNGBDBM39163(3-chloranyl-1-(3,4-dichlorophenyl)-4-(3-methyl-4-p...)
Affinity DataIC50:  1.93E+4nM. Assay description: Sanford-Burnham Center for Chemical Genomics (SBCCG) Sanford-Burnham Medical Research Institute (San Diego, CA) NIH Molecular Libraries Screening Cen...
In DepthDetails PCBioAssay