BDBM39164 3-chloranyl-1-(3,4-dichlorophenyl)-4-(2-methyl-3-oxidanylidene-piperazin-1-yl)pyrrole-2,5-dione::3-chloro-1-(3,4-dichlorophenyl)-4-(2-methyl-3-oxo-1-piperazinyl)pyrrole-2,5-dione::3-chloro-1-(3,4-dichlorophenyl)-4-(2-methyl-3-oxopiperazin-1-yl)-1H-pyrrole-2,5-dione::3-chloro-1-(3,4-dichlorophenyl)-4-(2-methyl-3-oxopiperazin-1-yl)pyrrole-2,5-dione::3-chloro-1-(3,4-dichlorophenyl)-4-(3-keto-2-methyl-piperazino)-3-pyrroline-2,5-quinone::CHEMBL1272049::MLS-0090884.0001::cid_16654679
SMILES CC1N(CCNC1=O)C1=C(Cl)C(=O)N(C1=O)c1ccc(Cl)c(Cl)c1
InChI Key InChIKey=LAJCAHFPXAHWMM-UHFFFAOYSA-N
Data  4 IC50
  Tab Delimited (TSV)   2D SDfile   Computed 3D by Vconf -m prep SDfile
Find this compound or compounds like it in BindingDB:
Activity Spreadsheet -- Enzyme Inhibition Constant Data from BindingDB
Found 4 hits for monomerid = 39164
TargetBcl-2-related protein A1(Mus musculus (Mouse))
Sanford-Burnham Center For Chemical Genomics
Curated by PubChem BioAssay
LigandPNGBDBM39164(3-chloranyl-1-(3,4-dichlorophenyl)-4-(2-methyl-3-o...)
Affinity DataIC50:  5.63E+3nM. Assay description: Data Source: Sanford-Burnham Center for Chemical Genomics (SBCCG) Source Affiliation: Sanford-Burnham Medical Research Institute (SBMRI, San Diego, C...
In DepthDetails PCBioAssay
TargetBcl-2-related protein A1(Homo sapiens (Human))
Human Biomolecular Research Institute
Curated by ChEMBL
LigandPNGBDBM39164(3-chloranyl-1-(3,4-dichlorophenyl)-4-(2-methyl-3-o...)
Affinity DataIC50:  2.00E+3nM. Assay description: Inhibition of N-terminal FITC BH3 peptide binding to GST-tagged Bfl1 by time resolved-FRET assay
In DepthDetails ArticlePubMed
TargetBcl-2-related protein A1(Homo sapiens (Human))
Human Biomolecular Research Institute
Curated by ChEMBL
LigandPNGBDBM39164(3-chloranyl-1-(3,4-dichlorophenyl)-4-(2-methyl-3-o...)
Affinity DataIC50:  5.60E+3nM. Assay description: Inhibition of N-terminal FITC BH3 peptide binding to GST-tagged Bfl1 by fluorescence polarization assay
In DepthDetails ArticlePubMed
TargetBcl-2-related protein A1(Mus musculus (Mouse))
Sanford-Burnham Center For Chemical Genomics
Curated by PubChem BioAssay
LigandPNGBDBM39164(3-chloranyl-1-(3,4-dichlorophenyl)-4-(2-methyl-3-o...)
Affinity DataIC50:  2.03E+3nM. Assay description: Sanford-Burnham Center for Chemical Genomics (SBCCG) Sanford-Burnham Medical Research Institute (San Diego, CA) NIH Molecular Libraries Screening Cen...
In DepthDetails PCBioAssay