BDBM391722 N-[(2R)-1-({(2S)-3-(1-::US10300056, Example 7::US10888561, Example 7
SMILES CCN1CCC(C[C@H](NC(=O)[C@@H](Cc2cc(C)c3[nH]ncc3c2)NC(=O)N2CCC(CC2)c2cc3ccccc3[nH]c2=O)C(=O)N2CCN(CC2)c2ccncc2)CC1
InChI Key
Data  2 KI
  Tab Delimited (TSV)   2D SDfile   Computed 3D by Vconf -m prep SDfile
Find this compound or compounds like it in BindingDB:
Activity Spreadsheet -- Enzyme Inhibition Constant Data from BindingDB
Found 2 hits for monomerid = 391722
TargetReceptor activity-modifying protein 1(Homo sapiens (Human))
Heptares Therapeutics
US Patent
LigandPNGBDBM391722(N-[(2R)-1-({(2S)-3-(1- | US10300056, Example 7 | U...)
Affinity DataKi:  0.0400nM. Assay description: Radioligand binding assay. Human CGRP receptors expressed (consisting of CRLR and RAMP1) in insect Sf21 cell membrane homogenates were re-suspended i...
Ligand InfoPC cidPC sid
In DepthDetails US Patent
TargetReceptor activity-modifying protein 1(Homo sapiens (Human))
Heptares Therapeutics
US Patent
LigandPNGBDBM391722(N-[(2R)-1-({(2S)-3-(1- | US10300056, Example 7 | U...)
Affinity DataKi:  0.0400nM. Assay description: Human CGRP receptors expressed (consisting of CRLR and RAMP1) in insect Sf21 cell membrane homogenates were re-suspended in the binding buffer (10 mM...
Ligand InfoPC cidPC sid
In DepthDetails US Patent