BDBM39182 3-chloranyl-1-(2-chloranylpyridin-4-yl)-4-[4-[2-(2-hydroxyethyloxy)ethyl]piperazin-1-yl]pyrrole-2,5-dione::3-chloro-1-(2-chloro-4-pyridinyl)-4-[4-[2-(2-hydroxyethoxy)ethyl]-1-piperazinyl]pyrrole-2,5-dione::3-chloro-1-(2-chloro-4-pyridyl)-4-[4-[2-(2-hydroxyethoxy)ethyl]piperazino]-3-pyrroline-2,5-quinone::3-chloro-1-(2-chloropyridin-4-yl)-4-[4-[2-(2-hydroxyethoxy)ethyl]piperazin-1-yl]pyrrole-2,5-dione::MLS-0111806.0001::cid_16654827
SMILES OCCOCCN1CCN(CC1)C1=C(Cl)C(=O)N(C1=O)c1ccnc(Cl)c1
InChI Key InChIKey=OAWDUZFYDZZULP-UHFFFAOYSA-N
Data  2 IC50
  Tab Delimited (TSV)   2D SDfile   Computed 3D by Vconf -m prep SDfile
Find this compound or compounds like it in BindingDB:
Activity Spreadsheet -- Enzyme Inhibition Constant Data from BindingDB
Found 2 hits for monomerid = 39182
TargetBcl-2-related protein A1(Mus musculus (Mouse))
Sanford-Burnham Center For Chemical Genomics
Curated by PubChem BioAssay
LigandPNGBDBM39182(3-chloranyl-1-(2-chloranylpyridin-4-yl)-4-[4-[2-(2...)
Affinity DataIC50:  2.05E+4nM. Assay description: Sanford-Burnham Center for Chemical Genomics (SBCCG) Sanford-Burnham Medical Research Institute (San Diego, CA) NIH Molecular Libraries Screening Cen...
In DepthDetails PCBioAssay
TargetBcl-2-related protein A1(Mus musculus (Mouse))
Sanford-Burnham Center For Chemical Genomics
Curated by PubChem BioAssay
LigandPNGBDBM39182(3-chloranyl-1-(2-chloranylpyridin-4-yl)-4-[4-[2-(2...)
Affinity DataIC50:  3.32E+4nM. Assay description: Data Source: Sanford-Burnham Center for Chemical Genomics (SBCCG) Source Affiliation: Sanford-Burnham Medical Research Institute (SBMRI, San Diego, C...
In DepthDetails PCBioAssay