BDBM391957 1-(4-Bromophenyl)-3- [(1S)-1-(1H-imidazol-2- yl)butyl]urea::US10301269, Number 2::US10800744, Number 2
SMILES CCC[C@H](NC(=O)Nc1ccc(Br)cc1)c1ncc[nH]1
InChI Key
Data  2 EC50
  Tab Delimited (TSV)   2D SDfile   Computed 3D by Vconf -m prep SDfile
Find this compound or compounds like it in BindingDB:
Activity Spreadsheet -- Enzyme Inhibition Constant Data from BindingDB
Found 2 hits for monomerid = 391957
TargetN-formyl peptide receptor 2(Homo sapiens (Human))
Allergan
US Patent
LigandPNGBDBM391957(1-(4-Bromophenyl)-3- [(1S)-1-(1H-imidazol-2- yl)bu...)
Affinity DataEC50:  2.07E+3nM. Assay description: Biological activity of compounds according to Formula I is set forth in Table 7 below. CHO-Gα16 cells stably expressing FPR2 were cultured in (F...
Ligand InfoPC cidPC sid
In DepthDetails US Patent
TargetN-formyl peptide receptor 2(Homo sapiens (Human))
Allergan
US Patent
LigandPNGBDBM391957(1-(4-Bromophenyl)-3- [(1S)-1-(1H-imidazol-2- yl)bu...)
Affinity DataEC50:  2.07E+3nM. Assay description: Biological activity of compounds according to Formula I is set forth in Table 7 below. CHO-Gα16 cells stably expressing FPR2 were cultured in (F...
Ligand InfoPC cidPC sid
In DepthDetails US Patent