BDBM391977 3-{2-[1-({[4- (Trifluoromethyl)phenyl] carbamoyl}amino) propyl]-1H-imidazol-1- yl}propanoic acid::US10301269, Number 22::US10800744, Number 22
SMILES CCC(NC(=O)Nc1ccc(cc1)C(F)(F)F)c1nccn1CCC(O)=O
InChI Key InChIKey=FMCZZWBAUIHDNR-UHFFFAOYSA-N
Data  2 EC50
  Tab Delimited (TSV)   2D SDfile   Computed 3D by Vconf -m prep SDfile
Find this compound or compounds like it in BindingDB:
Activity Spreadsheet -- Enzyme Inhibition Constant Data from BindingDB
Found 2 hits for monomerid = 391977
TargetN-formyl peptide receptor 2(Homo sapiens (Human))
Allergan
US Patent
LigandPNGBDBM391977(3-{2-[1-({[4- (Trifluoromethyl)phenyl] carbamoyl}a...)
Affinity DataEC50:  23nM. Assay description: Biological activity of compounds according to Formula I is set forth in Table 7 below. CHO-Gα16 cells stably expressing FPR2 were cultured in (F...
Ligand InfoPC cidPC sid
In DepthDetails US Patent
TargetN-formyl peptide receptor 2(Homo sapiens (Human))
Allergan
US Patent
LigandPNGBDBM391977(3-{2-[1-({[4- (Trifluoromethyl)phenyl] carbamoyl}a...)
Affinity DataEC50:  23nM. Assay description: Biological activity of compounds according to Formula I is set forth in Table 7 below. CHO-Gα16 cells stably expressing FPR2 were cultured in (F...
Ligand InfoPC cidPC sid
In DepthDetails US Patent