BDBM391987 US10301269, Number 33::US10800744, Number 33::tert-Butyl {2-[(1S)-1- ({[(4- chlorophenyl)amino] carbonyl}amino)-2- methylpropyl]-1H- imidazol-1-yl}acetate
SMILES CC(C)[C@H](NC(=O)Nc1ccc(Cl)cc1)c1nccn1CC(=O)OC(C)(C)C
InChI Key InChIKey=ONCCAPNQSLDTLD-KRWDZBQOSA-N
Data  2 EC50
  Tab Delimited (TSV)   2D SDfile   Computed 3D by Vconf -m prep SDfile
Find this compound or compounds like it in BindingDB:
Activity Spreadsheet -- Enzyme Inhibition Constant Data from BindingDB
Found 2 hits for monomerid = 391987
TargetN-formyl peptide receptor 2(Homo sapiens (Human))
Allergan
US Patent
LigandPNGBDBM391987(US10301269, Number 33 | US10800744, Number 33 | te...)
Affinity DataEC50:  361nM. Assay description: Biological activity of compounds according to Formula I is set forth in Table 7 below. CHO-Gα16 cells stably expressing FPR2 were cultured in (F...
Ligand InfoPC cidPC sid
In DepthDetails US Patent
TargetN-formyl peptide receptor 2(Homo sapiens (Human))
Allergan
US Patent
LigandPNGBDBM391987(US10301269, Number 33 | US10800744, Number 33 | te...)
Affinity DataEC50:  361nM. Assay description: Biological activity of compounds according to Formula I is set forth in Table 7 below. CHO-Gα16 cells stably expressing FPR2 were cultured in (F...
Ligand InfoPC cidPC sid
In DepthDetails US Patent