BDBM391994 2-(2-{(1S)-2-methyl-1- [({[4-(trifluoromethyl) phenyl]amino}carbonyl) amino]propyl}-1H- imdazol-1-yl)acetamide::US10301269, Number 40::US10800744, Number 40
SMILES CC(C)[C@H](NC(=O)Nc1ccc(cc1)C(F)(F)F)c1nccn1CC(N)=O
InChI Key InChIKey=WTLVSUQHIYDEEL-AWEZNQCLSA-N
Data  2 EC50
  Tab Delimited (TSV)   2D SDfile   Computed 3D by Vconf -m prep SDfile
Find this compound or compounds like it in BindingDB:
Activity Spreadsheet -- Enzyme Inhibition Constant Data from BindingDB
Found 2 hits for monomerid = 391994
TargetN-formyl peptide receptor 2(Homo sapiens (Human))
Allergan
US Patent
LigandPNGBDBM391994(2-(2-{(1S)-2-methyl-1- [({[4-(trifluoromethyl) phe...)
Affinity DataEC50:  43nM. Assay description: Biological activity of compounds according to Formula I is set forth in Table 7 below. CHO-Gα16 cells stably expressing FPR2 were cultured in (F...
Ligand InfoPC cidPC sid
In DepthDetails US Patent
TargetN-formyl peptide receptor 2(Homo sapiens (Human))
Allergan
US Patent
LigandPNGBDBM391994(2-(2-{(1S)-2-methyl-1- [({[4-(trifluoromethyl) phe...)
Affinity DataEC50:  43nM. Assay description: Biological activity of compounds according to Formula I is set forth in Table 7 below. CHO-Gα16 cells stably expressing FPR2 were cultured in (F...
Ligand InfoPC cidPC sid
In DepthDetails US Patent