BDBM39209 1-Methyl-1H-benzo[cd]indol-2-one oxime::1-methyl-2-benzo[cd]indolone oxime::1-methylbenzo[cd]indol-2-one oxime::MLS000070236::N-(1-methylbenzo[cd]indol-2-ylidene)hydroxylamine::SMR000008638::cid_655545
SMILES CN1C(N=O)c2cccc3cccc1c23
InChI Key InChIKey=PCEVUWRKIPJSQW-UHFFFAOYSA-N
Data  2 IC50
  Tab Delimited (TSV)   2D SDfile   Computed 3D by Vconf -m prep SDfile
Find this compound or compounds like it in BindingDB:
Activity Spreadsheet -- Enzyme Inhibition Constant Data from BindingDB
Found 2 hits for monomerid = 39209
TargetProtein artemis(Homo sapiens (Human))
Burnham Center For Chemical Genomics
Curated by PubChem BioAssay
LigandPNGBDBM39209(1-Methyl-1H-benzo[cd]indol-2-one oxime | 1-methyl-...)
Affinity DataIC50:  2.00E+4nM. Assay description: Data Source: Sanford-Burnham Center for Chemical Genomics (SBCCG) Source Affiliation: Sanford-Burnham Medical Research Institute (SBMRI, San Diego CA...
Ligand InfoPC cidPC sid
In DepthDetails PCBioAssay
TargetRho-associated protein kinase 2(Homo sapiens (Human))
The Scripps Research Institute Molecular Screening Center
Curated by PubChem BioAssay
LigandPNGBDBM39209(1-Methyl-1H-benzo[cd]indol-2-one oxime | 1-methyl-...)
Affinity DataIC50: >1.99E+4nM. Assay description: Source (MLSCN Center Name): The Scripps Research Institute Molecular Screening Center Center Affiliation: The Scripps Research Institute, TSRI Assay ...
Ligand InfoPC cidPC sid
In DepthDetails PCBioAssay