BDBM392577 N4-((6-amino-2,4-dimethylpyridin-3- yl)methyl)-1-((8-cyano-3- methylquinolin-6-yl)methyl)-1H- pyrazole-3,4-dicarboxamide::US10301284, Example 63::US10781200, Example 63
SMILES Cc1cnc2c(cc(Cn3cc(C(=O)NCc4c(C)cc(N)nc4C)c(n3)C(N)=O)cc2c1)C#N
InChI Key InChIKey=KOPPRFDMDJZZCZ-UHFFFAOYSA-N
Data  2 IC50
  Tab Delimited (TSV)   2D SDfile   Computed 3D by Vconf -m prep SDfile
Find this compound or compounds like it in BindingDB:
Activity Spreadsheet -- Enzyme Inhibition Constant Data from BindingDB
Found 2 hits for monomerid = 392577
TargetPlasma kallikrein(Homo sapiens (Human))
Attune Pharmaceuticals
US Patent
LigandPNGBDBM392577(N4-((6-amino-2,4-dimethylpyridin-3- yl)methyl)-1-(...)
Affinity DataIC50:  550nM. Assay description: A 10 mM solution of the test compound was made in DMSO. This solution was serially diluted 1:5 in DMSO to yield 2000, 400, 80, 16, 3.2, 0.64, 0.128, ...
Ligand InfoPC cidPC sid
In DepthDetails US Patent
TargetPlasma kallikrein(Homo sapiens (Human))
Attune Pharmaceuticals
US Patent
LigandPNGBDBM392577(N4-((6-amino-2,4-dimethylpyridin-3- yl)methyl)-1-(...)
Affinity DataIC50:  550nM. Assay description: A 10 mM solution of the test compound was made in DMSO. This solution was serially diluted 1:5 in DMSO to yield 2000, 400, 80, 16, 3.2, 0.64, 0.128, ...
Ligand InfoPC cidPC sid
In DepthDetails US Patent