BDBM392591 6-((4-(((6-amino-2,4-dimethylpyridin- 3-yl)methyl)carbamoyl)-3-cyano-1H- pyrazol-1-yl)methyl)-3- methylquinoline-8-carboxamide::US10301284, Example 78::US10781200, Example 78
SMILES Cc1cnc2c(cc(Cn3cc(C(=O)NCc4c(C)cc(N)nc4C)c(n3)C#N)cc2c1)C(N)=O
InChI Key InChIKey=KWOBNPHUEXOCGN-UHFFFAOYSA-N
Data  2 IC50
  Tab Delimited (TSV)   2D SDfile   Computed 3D by Vconf -m prep SDfile
Find this compound or compounds like it in BindingDB:
Activity Spreadsheet -- Enzyme Inhibition Constant Data from BindingDB
Found 2 hits for monomerid = 392591
TargetPlasma kallikrein(Homo sapiens (Human))
Attune Pharmaceuticals
US Patent
LigandPNGBDBM392591(6-((4-(((6-amino-2,4-dimethylpyridin- 3-yl)methyl)...)
Affinity DataIC50: <100nM. Assay description: A 10 mM solution of the test compound was made in DMSO. This solution was serially diluted 1:5 in DMSO to yield 2000, 400, 80, 16, 3.2, 0.64, 0.128, ...
Ligand InfoPC cidPC sid
In DepthDetails US Patent
TargetPlasma kallikrein(Homo sapiens (Human))
Attune Pharmaceuticals
US Patent
LigandPNGBDBM392591(6-((4-(((6-amino-2,4-dimethylpyridin- 3-yl)methyl)...)
Affinity DataIC50: <100nM. Assay description: A 10 mM solution of the test compound was made in DMSO. This solution was serially diluted 1:5 in DMSO to yield 2000, 400, 80, 16, 3.2, 0.64, 0.128, ...
Ligand InfoPC cidPC sid
In DepthDetails US Patent