BDBM392593 N-((6-amino-2,4-dimethylpyridin-3- yl)methyl)-2-(3-chloroquinoline-6- carbonyl)oxazole-5-carboxamide::US10301284, Example 80::US10781200, Example 80
SMILES Cc1cc(N)nc(C)c1CNC(=O)c1cnc(o1)C(=O)c1ccc2ncc(Cl)cc2c1
InChI Key InChIKey=GTELKVRQDBZNKH-UHFFFAOYSA-N
Data  2 IC50
  Tab Delimited (TSV)   2D SDfile   Computed 3D by Vconf -m prep SDfile
Find this compound or compounds like it in BindingDB:
Activity Spreadsheet -- Enzyme Inhibition Constant Data from BindingDB
Found 2 hits for monomerid = 392593
TargetPlasma kallikrein(Homo sapiens (Human))
Attune Pharmaceuticals
US Patent
LigandPNGBDBM392593(N-((6-amino-2,4-dimethylpyridin-3- yl)methyl)-2-(3...)
Affinity DataIC50: >1.00E+4nM. Assay description: A 10 mM solution of the test compound was made in DMSO. This solution was serially diluted 1:5 in DMSO to yield 2000, 400, 80, 16, 3.2, 0.64, 0.128, ...
Ligand InfoPC cidPC sid
In DepthDetails US Patent
TargetPlasma kallikrein(Homo sapiens (Human))
Attune Pharmaceuticals
US Patent
LigandPNGBDBM392593(N-((6-amino-2,4-dimethylpyridin-3- yl)methyl)-2-(3...)
Affinity DataIC50: >1.00E+4nM. Assay description: A 10 mM solution of the test compound was made in DMSO. This solution was serially diluted 1:5 in DMSO to yield 2000, 400, 80, 16, 3.2, 0.64, 0.128, ...
Ligand InfoPC cidPC sid
In DepthDetails US Patent