BDBM392652 N-((6-amino-2-methylpyridin-3- yl)methyl)-1-((3-chloroquinolin-6- yl)methyl)-5-oxo-4,5-dihydro-1H- pyrazolo[4,3-b]pyridine-3- carboxamide::US10301284, Example 139::US10781200, Example 139
SMILES Cc1nc(N)ccc1CNC(=O)c1nn(Cc2ccc3ncc(Cl)cc3c2)c2ccc(=O)[nH]c12
InChI Key InChIKey=SUSGOGCPZRQBIA-UHFFFAOYSA-N
Data  2 IC50
  Tab Delimited (TSV)   2D SDfile   Computed 3D by Vconf -m prep SDfile
Find this compound or compounds like it in BindingDB:
Activity Spreadsheet -- Enzyme Inhibition Constant Data from BindingDB
Found 2 hits for monomerid = 392652
TargetPlasma kallikrein(Homo sapiens (Human))
Attune Pharmaceuticals
US Patent
LigandPNGBDBM392652(N-((6-amino-2-methylpyridin-3- yl)methyl)-1-((3-ch...)
Affinity DataIC50: <100nM. Assay description: A 10 mM solution of the test compound was made in DMSO. This solution was serially diluted 1:5 in DMSO to yield 2000, 400, 80, 16, 3.2, 0.64, 0.128, ...
Ligand InfoPC cidPC sid
In DepthDetails US Patent
TargetPlasma kallikrein(Homo sapiens (Human))
Attune Pharmaceuticals
US Patent
LigandPNGBDBM392652(N-((6-amino-2-methylpyridin-3- yl)methyl)-1-((3-ch...)
Affinity DataIC50: <100nM. Assay description: A 10 mM solution of the test compound was made in DMSO. This solution was serially diluted 1:5 in DMSO to yield 2000, 400, 80, 16, 3.2, 0.64, 0.128, ...
Ligand InfoPC cidPC sid
In DepthDetails US Patent