BDBM39317 3-fluoranyl-N-pyridin-4-yl-benzamide::3-fluoro-N-(4-pyridyl)benzamide::3-fluoro-N-pyridin-4-ylbenzamide::MLS000104912::SMR000054842::cid_693068
SMILES Fc1cccc(c1)C(=O)Nc1ccncc1
InChI Key InChIKey=CLTWXEOKGHKFQX-UHFFFAOYSA-N
Data  1 IC50
  Tab Delimited (TSV)   2D SDfile   Computed 3D by Vconf -m prep SDfile
Find this compound or compounds like it in BindingDB:
Activity Spreadsheet -- Enzyme Inhibition Constant Data from BindingDB
Found 1 hit for monomerid = 39317
TargetRho-associated protein kinase 2(Homo sapiens (Human))
The Scripps Research Institute Molecular Screening Center
Curated by PubChem BioAssay
LigandPNGBDBM39317(3-fluoranyl-N-pyridin-4-yl-benzamide | 3-fluoro-N-...)
Affinity DataIC50:  6.79E+3nM. Assay description: Source (MLSCN Center Name): The Scripps Research Institute Molecular Screening Center Center Affiliation: The Scripps Research Institute, TSRI Assay ...
In DepthDetails PCBioAssay