BDBM39332 4-(2-Oxo-1-oxa-spiro[4.5]dec-3-en-4-yl)-piperazine-1-carboxylic acid ethyl ester::4-(2-keto-1-oxaspiro[4.5]dec-3-en-4-yl)piperazine-1-carboxylic acid ethyl ester::4-(2-oxo-1-oxaspiro[4.5]dec-3-en-4-yl)-1-piperazinecarboxylic acid ethyl ester::MLS000029789::SMR000011703::cid_651847::ethyl 4-(2-oxidanylidene-1-oxaspiro[4.5]dec-3-en-4-yl)piperazine-1-carboxylate::ethyl 4-(2-oxo-1-oxaspiro[4.5]dec-3-en-4-yl)piperazine-1-carboxylate
SMILES CCOC(=O)N1CCN(CC1)C1=CC(=O)OC11CCCCC1
InChI Key InChIKey=PEDUOYDXFNYXOC-UHFFFAOYSA-N
Data  1 IC50
  Tab Delimited (TSV)   2D SDfile   Computed 3D by Vconf -m prep SDfile
Find this compound or compounds like it in BindingDB:
Activity Spreadsheet -- Enzyme Inhibition Constant Data from BindingDB
Found 1 hit for monomerid = 39332
TargetGenome polyprotein(West Nile virus)
University Of Pittsburgh
Curated by PubChem BioAssay
LigandPNGBDBM39332(4-(2-Oxo-1-oxa-spiro[4.5]dec-3-en-4-yl)-piperazine...)
Affinity DataIC50: >5.00E+4nM. Assay description: The HTS assay to identify Inhibitors of West Nile Virus (WNV) NS2bNS3 Proteinase was proposed by Dr Alex Strongin of the Burnham Institute XO1-MH0776...
In DepthDetails PCBioAssay