BDBM39337 3-(4-Chloro-benzenesulfonyl)-1,3,5-triaza-bicyclo[3.2.1]octane::3-(4-chlorophenyl)sulfonyl-1,3,5-triazabicyclo[3.2.1]octane::MLS000034976::SMR000014062::cid_655626
SMILES Clc1ccc(cc1)S(=O)(=O)N1CN2CCN(C2)C1
InChI Key InChIKey=NCANXSRQGZTDKV-UHFFFAOYSA-N
Data  1 IC50
  Tab Delimited (TSV)   2D SDfile   Computed 3D by Vconf -m prep SDfile
Find this compound or compounds like it in BindingDB:
Activity Spreadsheet -- Enzyme Inhibition Constant Data from BindingDB
Found 1 hit for monomerid = 39337
TargetGenome polyprotein(West Nile virus)
University Of Pittsburgh
Curated by PubChem BioAssay
LigandPNGBDBM39337(3-(4-Chloro-benzenesulfonyl)-1,3,5-triaza-bicyclo[...)
Affinity DataIC50: >5.00E+4nM. Assay description: The HTS assay to identify Inhibitors of West Nile Virus (WNV) NS2bNS3 Proteinase was proposed by Dr Alex Strongin of the Burnham Institute XO1-MH0776...
In DepthDetails PCBioAssay