BDBM39356 3-(3-bromophenyl)-6,7,8,9-tetrahydro-5H-imidaz[1,2-a]azepine;hydrochloride::3-(3-bromophenyl)-6,7,8,9-tetrahydro-5H-imidazo[1,2-a]azepine;hydrochloride::MLS000028287::SMR000038747::cid_6603423
SMILES Brc1cccc(c1)-c1cnc2CCCCCn12
InChI Key InChIKey=DWSFSUMEOQVZMV-UHFFFAOYSA-N
Data  1 IC50
  Tab Delimited (TSV)   2D SDfile   Computed 3D by Vconf -m prep SDfile
Find this compound or compounds like it in BindingDB:
Activity Spreadsheet -- Enzyme Inhibition Constant Data from BindingDB
Found 1 hit for monomerid = 39356
TargetGenome polyprotein(West Nile virus)
University Of Pittsburgh
Curated by PubChem BioAssay
LigandPNGBDBM39356(3-(3-bromophenyl)-6,7,8,9-tetrahydro-5H-imidaz[1,2...)
Affinity DataIC50: >5.00E+4nM. Assay description: The HTS assay to identify Inhibitors of West Nile Virus (WNV) NS2bNS3 Proteinase was proposed by Dr Alex Strongin of the Burnham Institute XO1-MH0776...
In DepthDetails PCBioAssay