BDBM39360 1-(2-methoxyphenyl)-2-(2-morpholin-4-yl-2-oxidanylidene-ethyl)sulfanyl-6-oxidanyl-5-(phenylmethyl)pyrimidin-4-one::5-benzyl-6-hydroxy-1-(2-methoxyphenyl)-2-(2-morpholin-4-yl-2-oxoethyl)sulfanylpyrimidin-4-one::5-benzyl-6-hydroxy-2-[(2-keto-2-morpholino-ethyl)thio]-1-(2-methoxyphenyl)pyrimidin-4-one::6-hydroxy-1-(2-methoxyphenyl)-2-[[2-(4-morpholinyl)-2-oxoethyl]thio]-5-(phenylmethyl)-4-pyrimidinone::MLS000078329::SMR000039948::cid_658944
SMILES COc1ccccc1-n1c(SCC(=O)N2CCOCC2)nc(O)c(Cc2ccccc2)c1=O
InChI Key InChIKey=XTNMFDJFGYQSJD-UHFFFAOYSA-N
Data  1 IC50
  Tab Delimited (TSV)   2D SDfile   Computed 3D by Vconf -m prep SDfile
Find this compound or compounds like it in BindingDB:
Activity Spreadsheet -- Enzyme Inhibition Constant Data from BindingDB
Found 1 hit for monomerid = 39360
TargetGenome polyprotein(West Nile virus)
University Of Pittsburgh
Curated by PubChem BioAssay
LigandPNGBDBM39360(1-(2-methoxyphenyl)-2-(2-morpholin-4-yl-2-oxidanyl...)
Affinity DataIC50:  5.00E+4nM. Assay description: The HTS assay to identify Inhibitors of West Nile Virus (WNV) NS2bNS3 Proteinase was proposed by Dr Alex Strongin of the Burnham Institute XO1-MH0776...
In DepthDetails PCBioAssay