BDBM39363 7-(trifluoromethyl)-5-(3,4,5-trimethoxyphenyl)-1,5,6,7-tetrahydropyrazolo[1,5-a]pyrimidine-3-carboxylic acid::MLS000079500::SMR000035172::cid_5292324
SMILES COc1cc(cc(OC)c1OC)C1CC(n2ncc(C(O)=O)c2N1)C(F)(F)F
InChI Key InChIKey=KWYRCMJZJUBVFA-UHFFFAOYSA-N
Data  2 IC50
  Tab Delimited (TSV)   2D SDfile   Computed 3D by Vconf -m prep SDfile
Find this compound or compounds like it in BindingDB:
Activity Spreadsheet -- Enzyme Inhibition Constant Data from BindingDB
Found 2 hits for monomerid = 39363
TargetGlycoprotein 42(Human herpesvirus 4 type 2)
Emory University
Curated by PubChem BioAssay
LigandPNGBDBM39363(7-(trifluoromethyl)-5-(3,4,5-trimethoxyphenyl)-1,5...)
Affinity DataIC50:  5.40E+4nM. Assay description: NIH Molecular Libraries Screening Centers Network [MLSCN] Emory Chemical Biology Discovery Center in MLSCN Assay provider: Theodore Jardetzky; Northw...
In DepthDetails PCBioAssay
TargetGenome polyprotein(West Nile virus)
University Of Pittsburgh
Curated by PubChem BioAssay
LigandPNGBDBM39363(7-(trifluoromethyl)-5-(3,4,5-trimethoxyphenyl)-1,5...)
Affinity DataIC50: >5.00E+4nM. Assay description: The HTS assay to identify Inhibitors of West Nile Virus (WNV) NS2bNS3 Proteinase was proposed by Dr Alex Strongin of the Burnham Institute XO1-MH0776...
In DepthDetails PCBioAssay