BDBM39371 5-methoxy-1,2-dimethyl-4-[(2-piperidinoacetyl)amino]indole-3-carboxylic acid ethyl ester::5-methoxy-1,2-dimethyl-4-[[1-oxo-2-(1-piperidinyl)ethyl]amino]-3-indolecarboxylic acid ethyl ester::MLS000039986::SMR000042789::cid_662109::ethyl 5-methoxy-1,2-dimethyl-4-(2-piperidin-1-ylethanoylamino)indole-3-carboxylate::ethyl 5-methoxy-1,2-dimethyl-4-[(2-piperidin-1-ylacetyl)amino]indole-3-carboxylate
SMILES CCOC(=O)c1c(C)n(C)c2ccc(OC)c(NC(=O)CN3CCCCC3)c12
InChI Key InChIKey=QPOCBUQWHFOOIK-UHFFFAOYSA-N
Data  1 IC50
  Tab Delimited (TSV)   2D SDfile   Computed 3D by Vconf -m prep SDfile
Find this compound or compounds like it in BindingDB:
Activity Spreadsheet -- Enzyme Inhibition Constant Data from BindingDB
Found 1 hit for monomerid = 39371
TargetGenome polyprotein(West Nile virus)
University Of Pittsburgh
Curated by PubChem BioAssay
LigandPNGBDBM39371(5-methoxy-1,2-dimethyl-4-[(2-piperidinoacetyl)amin...)
Affinity DataIC50: >5.00E+4nM. Assay description: The HTS assay to identify Inhibitors of West Nile Virus (WNV) NS2bNS3 Proteinase was proposed by Dr Alex Strongin of the Burnham Institute XO1-MH0776...
In DepthDetails PCBioAssay