BDBM39408 2-(3-cyano-7-ethyl-1-indolyl)-N-(2-furanylmethyl)acetamide::2-(3-cyano-7-ethyl-1H-indol-1-yl)-N-(2-furylmethyl)acetamide::2-(3-cyano-7-ethyl-indol-1-yl)-N-(2-furfuryl)acetamide::2-(3-cyano-7-ethyl-indol-1-yl)-N-(furan-2-ylmethyl)ethanamide::2-(3-cyano-7-ethylindol-1-yl)-N-(furan-2-ylmethyl)acetamide::MLS000063840::SMR000075735::cid_900747
SMILES CCc1cccc2c(cn(CC(=O)NCc3ccco3)c12)C#N
InChI Key InChIKey=OSEORGOCTPUJQO-UHFFFAOYSA-N
Data  1 IC50
  Tab Delimited (TSV)   2D SDfile   Computed 3D by Vconf -m prep SDfile
Find this compound or compounds like it in BindingDB:
Activity Spreadsheet -- Enzyme Inhibition Constant Data from BindingDB
Found 1 hit for monomerid = 39408
TargetGenome polyprotein(West Nile virus)
University Of Pittsburgh
Curated by PubChem BioAssay
LigandPNGBDBM39408(2-(3-cyano-7-ethyl-1-indolyl)-N-(2-furanylmethyl)a...)
Affinity DataIC50: >5.00E+4nM. Assay description: The HTS assay to identify Inhibitors of West Nile Virus (WNV) NS2bNS3 Proteinase was proposed by Dr Alex Strongin of the Burnham Institute XO1-MH0776...
In DepthDetails PCBioAssay