BDBM39413 MLS000115316::N-(5-bromo-2-p-anisoyl-benzofuran-3-yl)acetamide::N-[5-bromanyl-2-(4-methoxyphenyl)carbonyl-1-benzofuran-3-yl]ethanamide::N-[5-bromo-2-(4-methoxybenzoyl)-1-benzofuran-3-yl]acetamide::N-[5-bromo-2-[(4-methoxyphenyl)-oxomethyl]-3-benzofuranyl]acetamide::SMR000092461::cid_4103652
SMILES COc1ccc(cc1)C(=O)c1oc2ccc(Br)cc2c1NC(C)=O
InChI Key InChIKey=WXAKWFRQGLOBMF-UHFFFAOYSA-N
Data  1 IC50
  Tab Delimited (TSV)   2D SDfile   Computed 3D by Vconf -m prep SDfile
Find this compound or compounds like it in BindingDB:
Activity Spreadsheet -- Enzyme Inhibition Constant Data from BindingDB
Found 1 hit for monomerid = 39413
TargetGenome polyprotein(West Nile virus)
University Of Pittsburgh
Curated by PubChem BioAssay
LigandPNGBDBM39413(MLS000115316 | N-(5-bromo-2-p-anisoyl-benzofuran-3...)
Affinity DataIC50: >5.00E+4nM. Assay description: The HTS assay to identify Inhibitors of West Nile Virus (WNV) NS2bNS3 Proteinase was proposed by Dr Alex Strongin of the Burnham Institute XO1-MH0776...
In DepthDetails PCBioAssay