BDBM39414 5-(4-methoxyphenyl)-7-(3-methylphenyl)-1,5,6,7-tetrahydro-[1,2,4]triazolo[1,5-a]pyrimidine::5-(4-methoxyphenyl)-7-(m-tolyl)-1,5,6,7-tetrahydro-[1,2,4]triazolo[1,5-a]pyrimidine::MLS000114894::SMR000092170::cid_5309342
SMILES COc1ccc(cc1)C1CC(c2cccc(C)c2)n2ncnc2N1
InChI Key InChIKey=FKGAZANKFJFJLQ-UHFFFAOYSA-N
Data  1 IC50
  Tab Delimited (TSV)   2D SDfile   Computed 3D by Vconf -m prep SDfile
Find this compound or compounds like it in BindingDB:
Activity Spreadsheet -- Enzyme Inhibition Constant Data from BindingDB
Found 1 hit for monomerid = 39414
TargetGenome polyprotein(West Nile virus)
University Of Pittsburgh
Curated by PubChem BioAssay
LigandPNGBDBM39414(5-(4-methoxyphenyl)-7-(3-methylphenyl)-1,5,6,7-tet...)
Affinity DataIC50:  5.00E+4nM. Assay description: The HTS assay to identify Inhibitors of West Nile Virus (WNV) NS2bNS3 Proteinase was proposed by Dr Alex Strongin of the Burnham Institute XO1-MH0776...
In DepthDetails PCBioAssay