BDBM39415 6-[(3-methylimidazo[2,1-b][1,3]thiazol-6-yl)methylcarbamoyl]cyclohex-3-ene-1-carboxylic acid::6-[(3-methylimidazo[2,1-b]thiazol-6-yl)methylcarbamoyl]cyclohex-3-ene-1-carboxylic acid::6-[[(3-methyl-6-imidazo[2,1-b]thiazolyl)methylamino]-oxomethyl]-1-cyclohex-3-enecarboxylic acid::MLS000100420::SMR000018210::cid_5310233
SMILES Cc1csc2nc(CNC(=O)C3CC=CCC3C(O)=O)cn12
InChI Key InChIKey=JNWQGDIZBYYIHC-UHFFFAOYSA-N
Data  1 IC50
  Tab Delimited (TSV)   2D SDfile   Computed 3D by Vconf -m prep SDfile
Find this compound or compounds like it in BindingDB:
Activity Spreadsheet -- Enzyme Inhibition Constant Data from BindingDB
Found 1 hit for monomerid = 39415
TargetGenome polyprotein(West Nile virus)
University Of Pittsburgh
Curated by PubChem BioAssay
LigandPNGBDBM39415(6-[(3-methylimidazo[2,1-b][1,3]thiazol-6-yl)methyl...)
Affinity DataIC50:  5.00E+4nM. Assay description: The HTS assay to identify Inhibitors of West Nile Virus (WNV) NS2bNS3 Proteinase was proposed by Dr Alex Strongin of the Burnham Institute XO1-MH0776...
Ligand InfoPC cidPC sid
In DepthDetails PCBioAssay