BDBM39420 4-Hydroxy-8-methoxy-quinoline-3-carboxylic acid (thiophen-2-ylmethyl)-amide::4-keto-8-methoxy-N-(2-thenyl)-1H-quinoline-3-carboxamide::8-methoxy-4-oxidanylidene-N-(thiophen-2-ylmethyl)-1H-quinoline-3-carboxamide::8-methoxy-4-oxo-N-(thiophen-2-ylmethyl)-1H-quinoline-3-carboxamide::MLS000033055::SMR000006201::cid_645818
SMILES COc1cccc2c(O)c(cnc12)C(=O)NCc1cccs1
InChI Key InChIKey=XIIVPABVOIFYAE-UHFFFAOYSA-N
Data  1 IC50  2 EC50
  Tab Delimited (TSV)   2D SDfile   Computed 3D by Vconf -m prep SDfile
Find this compound or compounds like it in BindingDB:
Activity Spreadsheet -- Enzyme Inhibition Constant Data from BindingDB
Found 3 hits for monomerid = 39420
TargetSteroidogenic factor 1(Homo sapiens (Human))
The Scripps Research Institute Molecular Screening Center
Curated by PubChem BioAssay
LigandPNGBDBM39420(4-Hydroxy-8-methoxy-quinoline-3-carboxylic acid (t...)
Affinity DataEC50:  6.65E+3nM. Assay description: Source (MLSCN Center Name): The Scripps Research Institute Molecular Screening Center Center Affiliation: The Scripps Research Institute, TSRI Assay ...
In DepthDetails PCBioAssay
TargetMitogen-activated protein kinase 10(Homo sapiens (Human))
The Scripps Research Institute Molecular Screening Center
Curated by PubChem BioAssay
LigandPNGBDBM39420(4-Hydroxy-8-methoxy-quinoline-3-carboxylic acid (t...)
Affinity DataIC50:  1.89E+4nM. Assay description: Source (MLSCN Center Name): The Scripps Research Institute Molecular Screening Center Affiliation: The Scripps Research Institute, TSRI Assay Provide...
In DepthDetails PCBioAssay
TargetIsoform 2 of Nuclear receptor ROR-alpha (Alpha-2)(Homo sapiens (Human))
The Scripps Research Institute Molecular Screening Center
Curated by PubChem BioAssay
LigandPNGBDBM39420(4-Hydroxy-8-methoxy-quinoline-3-carboxylic acid (t...)
Affinity DataEC50:  3.12E+3nM. Assay description: Source (MLSCN Center Name): The Scripps Research Institute Molecular Screening Center Center Affiliation: The Scripps Research Institute, TSRI Assay ...
In DepthDetails PCBioAssay