BDBM394349 US10428087, Example 69::US10829502, Example 69::US11401280, Example 69::US9975907, Example 69
SMILES CC(Nc1ncnc2[nH]cnc12)c1nc2cccc(C)n2c(=O)c1-c1cc(F)cc(F)c1
InChI Key
Data  4 IC50
  Tab Delimited (TSV)   2D SDfile   Computed 3D by Vconf -m prep SDfile
Find this compound or compounds like it in BindingDB:
Activity Spreadsheet -- Enzyme Inhibition Constant Data from BindingDB
Found 4 hits for monomerid = 394349
TargetPhosphatidylinositol 4,5-bisphosphate 3-kinase catalytic subunit delta isoform(Homo sapiens (Human))
Incyte Holdings
US Patent
LigandPNGBDBM394349(US10428087, Example 69 | US10829502, Example 69 | ...)
Affinity DataIC50:  300nM. Assay description: The kinase reaction was conducted in polystyrene 384-well matrix white plate from Thermo Fisher Scientific in a final volume of 25 μL. Inhibitor...
Ligand InfoKEGGPC cidPC sid
In DepthDetails US Patent
TargetPhosphatidylinositol 4,5-bisphosphate 3-kinase catalytic subunit delta isoform(Homo sapiens (Human))
Incyte Holdings
US Patent
LigandPNGBDBM394349(US10428087, Example 69 | US10829502, Example 69 | ...)
Affinity DataIC50:  300nM. Assay description: PI3Kα, PI3Kβ, PI3Kγ: The kinase reaction was conducted in clear-bottom 96-well plate from Thermo Fisher Scientific in a final volume o...
Ligand InfoKEGGPC cidPC sid
In DepthDetails US Patent
TargetPhosphatidylinositol 4,5-bisphosphate 3-kinase catalytic subunit delta isoform(Homo sapiens (Human))
Incyte Holdings
US Patent
LigandPNGBDBM394349(US10428087, Example 69 | US10829502, Example 69 | ...)
Affinity DataIC50:  300nM. Assay description: Example A3: The kinase reaction was conducted in polystyrene 384-well matrix white plate from Thermo Fisher Scientific in a final volume of 25 μ...
Ligand InfoKEGGPC cidPC sid
In DepthDetails US Patent
TargetPhosphatidylinositol 4,5-bisphosphate 3-kinase catalytic subunit delta isoform(Homo sapiens (Human))
Incyte Holdings
US Patent
LigandPNGBDBM394349(US10428087, Example 69 | US10829502, Example 69 | ...)
Affinity DataIC50:  300nM. Assay description: Assay A2: The kinase reaction was conducted in clear-bottom 96-well plate from Thermo Fisher Scientific in a final volume of 24 μL. Inhibitors w...
Ligand InfoKEGGPC cidPC sid
In DepthDetails US Patent