BDBM39463 3-(2-thienyl)-1H-quinoxalin-2-one::3-thiophen-2-yl-1H-quinoxalin-2-one::MLS000053745::SMR000068248::cid_723698
SMILES O=c1[nH]c2ccccc2nc1-c1cccs1
InChI Key InChIKey=PWIKCZVHLJFOFW-UHFFFAOYSA-N
Data  3 EC50
  Tab Delimited (TSV)   2D SDfile   Computed 3D by Vconf -m prep SDfile
Find this compound or compounds like it in BindingDB:
Activity Spreadsheet -- Enzyme Inhibition Constant Data from BindingDB
Found 3 hits for monomerid = 39463
TargetSteroidogenic factor 1(Homo sapiens (Human))
The Scripps Research Institute Molecular Screening Center
Curated by PubChem BioAssay
LigandPNGBDBM39463(3-(2-thienyl)-1H-quinoxalin-2-one | 3-thiophen-2-y...)
Affinity DataEC50:  7.84E+3nM. Assay description: Source (MLSCN Center Name): The Scripps Research Institute Molecular Screening Center Center Affiliation: The Scripps Research Institute, TSRI Assay ...
In DepthDetails PCBioAssay
TargetProbable global transcription activator SNF2L2(Homo sapiens (Human))
The Scripps Research Institute Molecular Screening Center
Curated by PubChem BioAssay
LigandPNGBDBM39463(3-(2-thienyl)-1H-quinoxalin-2-one | 3-thiophen-2-y...)
Affinity DataEC50:  9.11E+4nM
In DepthDetails PCBioAssay
TargetIsoform 2 of Nuclear receptor ROR-alpha (Alpha-2)(Homo sapiens (Human))
The Scripps Research Institute Molecular Screening Center
Curated by PubChem BioAssay
LigandPNGBDBM39463(3-(2-thienyl)-1H-quinoxalin-2-one | 3-thiophen-2-y...)
Affinity DataEC50:  3.72E+3nM. Assay description: Source (MLSCN Center Name): The Scripps Research Institute Molecular Screening Center Center Affiliation: The Scripps Research Institute, TSRI Assay ...
In DepthDetails PCBioAssay