BDBM39481 2-[1-(3-methylphenyl)imidazol-2-yl]sulfanyl-N-(1,3-thiazol-2-yl)acetamide::2-[1-(3-methylphenyl)imidazol-2-yl]sulfanyl-N-(1,3-thiazol-2-yl)ethanamide::2-[[1-(3-methylphenyl)-2-imidazolyl]thio]-N-(2-thiazolyl)acetamide::2-[[1-(m-tolyl)imidazol-2-yl]thio]-N-thiazol-2-yl-acetamide::2-{[1-(3-methylphenyl)-1H-imidazol-2-yl]thio}-N-1,3-thiazol-2-ylacetamide::MLS000090725::SMR000025329::cid_866695
SMILES Cc1cccc(c1)-n1ccnc1SCC(=O)Nc1nccs1
InChI Key InChIKey=XFIAEOYIIPZYTP-UHFFFAOYSA-N
Data  2 EC50
  Tab Delimited (TSV)   2D SDfile   Computed 3D by Vconf -m prep SDfile
Find this compound or compounds like it in BindingDB:
Activity Spreadsheet -- Enzyme Inhibition Constant Data from BindingDB
Found 2 hits for monomerid = 39481
TargetIsoform 2 of Nuclear receptor ROR-alpha (Alpha-2)(Homo sapiens (Human))
The Scripps Research Institute Molecular Screening Center
Curated by PubChem BioAssay
LigandPNGBDBM39481(2-[1-(3-methylphenyl)imidazol-2-yl]sulfanyl-N-(1,3...)
Affinity DataEC50: >1.10E+4nM. Assay description: Source (MLSCN Center Name): The Scripps Research Institute Molecular Screening Center Center Affiliation: The Scripps Research Institute, TSRI Assay ...
In DepthDetails PCBioAssay
TargetSteroidogenic factor 1(Homo sapiens (Human))
The Scripps Research Institute Molecular Screening Center
Curated by PubChem BioAssay
LigandPNGBDBM39481(2-[1-(3-methylphenyl)imidazol-2-yl]sulfanyl-N-(1,3...)
Affinity DataEC50:  1.09E+4nM. Assay description: Source (MLSCN Center Name): The Scripps Research Institute Molecular Screening Center Center Affiliation: The Scripps Research Institute, TSRI Assay ...
In DepthDetails PCBioAssay