BDBM39482 MLS000087312::N-(6-tert-butyl-3-cyano-4,5,6,7-tetrahydro-1-benzothien-2-yl)-5-methylisoxazole-3-carboxamide::N-(6-tert-butyl-3-cyano-4,5,6,7-tetrahydro-1-benzothiophen-2-yl)-5-methyl-1,2-oxazole-3-carboxamide::N-(6-tert-butyl-3-cyano-4,5,6,7-tetrahydro-1-benzothiophen-2-yl)-5-methyl-3-isoxazolecarboxamide::N-(6-tert-butyl-3-cyano-4,5,6,7-tetrahydrobenzothiophen-2-yl)-5-methyl-isoxazole-3-carboxamide::SMR000023535::cid_3243783
SMILES Cc1cc(no1)C(=O)Nc1sc2CC(CCc2c1C#N)C(C)(C)C
InChI Key InChIKey=LKSJZZSXJLKEIT-UHFFFAOYSA-N
Data  2 EC50
  Tab Delimited (TSV)   2D SDfile   Computed 3D by Vconf -m prep SDfile
Find this compound or compounds like it in BindingDB:
Activity Spreadsheet -- Enzyme Inhibition Constant Data from BindingDB
Found 2 hits for monomerid = 39482
TargetIsoform 2 of Nuclear receptor ROR-alpha (Alpha-2)(Homo sapiens (Human))
The Scripps Research Institute Molecular Screening Center
Curated by PubChem BioAssay
LigandPNGBDBM39482(MLS000087312 | N-(6-tert-butyl-3-cyano-4,5,6,7-tet...)
Affinity DataEC50:  8.14E+3nM. Assay description: Source (MLSCN Center Name): The Scripps Research Institute Molecular Screening Center Center Affiliation: The Scripps Research Institute, TSRI Assay ...
In DepthDetails PCBioAssay
TargetSteroidogenic factor 1(Homo sapiens (Human))
The Scripps Research Institute Molecular Screening Center
Curated by PubChem BioAssay
LigandPNGBDBM39482(MLS000087312 | N-(6-tert-butyl-3-cyano-4,5,6,7-tet...)
Affinity DataEC50:  1.01E+4nM. Assay description: Source (MLSCN Center Name): The Scripps Research Institute Molecular Screening Center Center Affiliation: The Scripps Research Institute, TSRI Assay ...
In DepthDetails PCBioAssay