BDBM39516 (1,1-Dioxo-1H-1lambda*6*-benzo[d]isothiazol-3-yl)-(5-ethyl-[1,3,4]thiadiazol-2-yl)-amine::(1,1-diketo-1,2-benzothiazol-3-yl)-(5-ethyl-1,3,4-thiadiazol-2-yl)amine::MLS000031714::N-(5-ethyl-1,3,4-thiadiazol-2-yl)-1,1-bis(oxidanylidene)-1,2-benzothiazol-3-amine::N-(5-ethyl-1,3,4-thiadiazol-2-yl)-1,1-dioxo-1,2-benzothiazol-3-amine::SMR000012882::cid_626230
SMILES CCc1nnc(N=C2NS(=O)(=O)c3ccccc23)s1
InChI Key InChIKey=CBSMTSPBUDUITL-UHFFFAOYSA-N
Data  2 EC50
  Tab Delimited (TSV)   2D SDfile   Computed 3D by Vconf -m prep SDfile
Find this compound or compounds like it in BindingDB:
Activity Spreadsheet -- Enzyme Inhibition Constant Data from BindingDB
Found 2 hits for monomerid = 39516
TargetIsoform 2 of Nuclear receptor ROR-alpha (Alpha-2)(Homo sapiens (Human))
The Scripps Research Institute Molecular Screening Center
Curated by PubChem BioAssay
LigandPNGBDBM39516((1,1-Dioxo-1H-1lambda*6*-benzo[d]isothiazol-3-yl)-...)
Affinity DataEC50: >9.90E+4nM. Assay description: Source (MLSCN Center Name): The Scripps Research Institute Molecular Screening Center Center Affiliation: The Scripps Research Institute, TSRI Assay ...
Ligand InfoPC cidPC sid
In DepthDetails PCBioAssay
TargetSteroidogenic factor 1(Homo sapiens (Human))
The Scripps Research Institute Molecular Screening Center
Curated by PubChem BioAssay
LigandPNGBDBM39516((1,1-Dioxo-1H-1lambda*6*-benzo[d]isothiazol-3-yl)-...)
Affinity DataEC50: >3.67E+3nM. Assay description: Source (MLSCN Center Name): The Scripps Research Institute Molecular Screening Center Center Affiliation: The Scripps Research Institute, TSRI Assay ...
Ligand InfoPC cidPC sid
In DepthDetails PCBioAssay