BDBM395313 US10308636, Example 1-34
SMILES CC(C)(COc1ccc(cc1)-c1ccc(cn1)-c1ncc([nH]1)-c1cccs1)C(O)=O
InChI Key InChIKey=METOWYPXAWBSFH-UHFFFAOYSA-N
Data  1 IC50
  Tab Delimited (TSV)   2D SDfile   Computed 3D by Vconf -m prep SDfile
Find this compound or compounds like it in BindingDB:
Activity Spreadsheet -- Enzyme Inhibition Constant Data from BindingDB
Found 1 hit for monomerid = 395313
TargetDiacylglycerol O-acyltransferase 1(Homo sapiens (Human))
Mitsubishi Tanabe Pharma
US Patent
LigandPNGBDBM395313(US10308636, Example 1-34)
Affinity DataIC50:  2.10nM. Assay description: As a buffer used for the enzymatic reaction of DGAT1, 100 mM Tris-HCl (pH7.4), 200 mM Sucrose, and 20 mM MgCl2, 0.125% Bovin Serum Albumin (BSA) were...
Ligand InfoPC cidPC sid
In DepthDetails US Patent