BDBM395421 (R)-1-((2-(2′-chloro-3′-(3-(((S)-3-hydroxypyrrolidin-1-yl)methyl)-1,7-naphthyridin-8-ylamino)-2-methylbiphenyl-3-yl)-7-cyanobenzo[d]oxazol-5-yl)methyl)-3-methylpyrrolidine-3-carboxylic acid::US10308644, Example 34::US10800768, Example 34::US11339149, Example 34::US11596692, Compound P16
SMILES Cc1c(cccc1-c1cccc(Nc2nccc3cc(CN4CC[C@H](O)C4)cnc23)c1Cl)-c1nc2cc(CN3CC[C@](C)(C3)C(O)=O)cc(C#N)c2o1
InChI Key InChIKey=RHOVBJWKIZIBBI-FHHGEMOBSA-N
Data  5 IC50
  Tab Delimited (TSV)   2D SDfile   Computed 3D by Vconf -m prep SDfile
Find this compound or compounds like it in BindingDB:
Activity Spreadsheet -- Enzyme Inhibition Constant Data from BindingDB
Found 5 hits for monomerid = 395421
TargetProgrammed cell death 1 ligand 1 [19-238]/protein 1 [25-167](Homo sapiens (Human))
Incyte
US Patent
LigandPNGBDBM395421((R)-1-((2-(2′-chloro-3′-(3-(((S)-3-hyd...)
Affinity DataIC50: <10nM. Assay description: TBD
Ligand InfoPC cidPC sid
In DepthDetails US Patent
TargetProgrammed cell death 1 ligand 1 [19-238]/protein 1 [25-167](Homo sapiens (Human))
Incyte
US Patent
LigandPNGBDBM395421((R)-1-((2-(2′-chloro-3′-(3-(((S)-3-hyd...)
Affinity DataIC50: <0.100nM. Assay description: Binding assays were conducted in a low volume white 384-well polystyrene plate in a final volume of 20 μL. Compounds to be analyzed were first s...
Ligand InfoPC cidPC sid
In DepthDetails US Patent
TargetProgrammed cell death 1 ligand/protein 1(Homo sapiens)
Incyte
US Patent
LigandPNGBDBM395421((R)-1-((2-(2′-chloro-3′-(3-(((S)-3-hyd...)
Affinity DataIC50:  0.550nM. Assay description: Binding assays were conducted in a low volume white 384-well polystyrene plate in a final volume of 20 μL. Compounds to be analyzed were first s...
Ligand InfoPC cidPC sid
In DepthDetails US Patent
TargetProgrammed cell death 1 ligand 1 [19-238]/protein 1 [25-167](Homo sapiens (Human))
Incyte
US Patent
LigandPNGBDBM395421((R)-1-((2-(2′-chloro-3′-(3-(((S)-3-hyd...)
Affinity DataIC50: <10nM. Assay description: The assays were conducted in a standard black 384-well polystyrene plate with a final volume of 20 μL. Inhibitors were first serially diluted in...
Ligand InfoPC cidPC sid
In DepthDetails US Patent
TargetProgrammed cell death 1 ligand 1 [19-238]/protein 1 [25-167](Homo sapiens (Human))
Incyte
US Patent
LigandPNGBDBM395421((R)-1-((2-(2′-chloro-3′-(3-(((S)-3-hyd...)
Affinity DataIC50:  3.00E+3nM. Assay description: TBD
Ligand InfoPC cidPC sid
In DepthDetails US Patent