BDBM395498 (R)-1-((7-cyano-2-(3′-(5-(2-(isopropylamino)acetyl)-5,6-dihydro-4H-pyrrolo[3,4-d]thiazol-2-yl)-2,2′-dimethylbiphenyl-3-yl)benzo[d]oxazol-5-yl)methyl)pyrrolidine-3-carboxylic acid::US10308644, Example 110::US10800768, Example 110::US11339149, Example 110
SMILES CC(C)NCC(=O)N1Cc2nc(sc2C1)-c1cccc(c1C)-c1cccc(-c2nc3cc(CN4CC[C@H](C4)C(O)=O)cc(C#N)c3o2)c1C
InChI Key InChIKey=AKULZUNURKZOED-RUZDIDTESA-N
Data  3 IC50
  Tab Delimited (TSV)   2D SDfile   Computed 3D by Vconf -m prep SDfile
Find this compound or compounds like it in BindingDB:
Activity Spreadsheet -- Enzyme Inhibition Constant Data from BindingDB
Found 3 hits for monomerid = 395498
TargetProgrammed cell death 1 ligand 1 [19-238]/protein 1 [25-167](Homo sapiens (Human))
Incyte
US Patent
LigandPNGBDBM395498((R)-1-((7-cyano-2-(3′-(5-(2-(isopropylamino)...)
Affinity DataIC50: <10nM. Assay description: TBD
Ligand InfoPC cidPC sid
In DepthDetails US Patent
TargetProgrammed cell death 1 ligand 1 [19-238]/protein 1 [25-167](Homo sapiens (Human))
Incyte
US Patent
LigandPNGBDBM395498((R)-1-((7-cyano-2-(3′-(5-(2-(isopropylamino)...)
Affinity DataIC50: <10nM. Assay description: The assays were conducted in a standard black 384-well polystyrene plate with a final volume of 20 μL. Inhibitors were first serially diluted in...
Ligand InfoPC cidPC sid
In DepthDetails US Patent
TargetProgrammed cell death 1 ligand 1 [19-238]/protein 1 [25-167](Homo sapiens (Human))
Incyte
US Patent
LigandPNGBDBM395498((R)-1-((7-cyano-2-(3′-(5-(2-(isopropylamino)...)
Affinity DataIC50:  3.00E+3nM. Assay description: TBD
Ligand InfoPC cidPC sid
In DepthDetails US Patent