BDBM39557 5-amino-1-(4-bromo-2-fluoro-benzyl)-N-(3-methoxyphenyl)triazole-4-carboxamide::5-amino-1-[(4-bromo-2-fluorophenyl)methyl]-N-(3-methoxyphenyl)-4-triazolecarboxamide::5-amino-1-[(4-bromo-2-fluorophenyl)methyl]-N-(3-methoxyphenyl)triazole-4-carboxamide::5-azanyl-1-[(4-bromanyl-2-fluoranyl-phenyl)methyl]-N-(3-methoxyphenyl)-1,2,3-triazole-4-carboxamide::MLS000117971::SMR000094919::cid_5307774
SMILES COc1cccc(NC(=O)c2nnn(Cc3ccc(Br)cc3F)c2N)c1
InChI Key InChIKey=FFTDENXSAXUNNN-UHFFFAOYSA-N
Data  2 EC50
  Tab Delimited (TSV)   2D SDfile   Computed 3D by Vconf -m prep SDfile
Find this compound or compounds like it in BindingDB:
Activity Spreadsheet -- Enzyme Inhibition Constant Data from BindingDB
Found 2 hits for monomerid = 39557
TargetIsoform 2 of Nuclear receptor ROR-alpha (Alpha-2)(Homo sapiens (Human))
The Scripps Research Institute Molecular Screening Center
Curated by PubChem BioAssay
LigandPNGBDBM39557(5-amino-1-(4-bromo-2-fluoro-benzyl)-N-(3-methoxyph...)
Affinity DataEC50:  4.57E+3nM. Assay description: Source (MLSCN Center Name): The Scripps Research Institute Molecular Screening Center Center Affiliation: The Scripps Research Institute, TSRI Assay ...
In DepthDetails PCBioAssay
TargetSteroidogenic factor 1(Homo sapiens (Human))
The Scripps Research Institute Molecular Screening Center
Curated by PubChem BioAssay
LigandPNGBDBM39557(5-amino-1-(4-bromo-2-fluoro-benzyl)-N-(3-methoxyph...)
Affinity DataEC50:  4.38E+3nM. Assay description: Source (MLSCN Center Name): The Scripps Research Institute Molecular Screening Center Center Affiliation: The Scripps Research Institute, TSRI Assay ...
In DepthDetails PCBioAssay