BDBM39558 2-(6-keto-1-phenyl-pyridazin-3-yl)oxypropionic acid butyl ester::2-[(6-oxo-1-phenyl-3-pyridazinyl)oxy]propanoic acid butyl ester::MLS000114711::SMR000092049::butyl 2-(6-oxidanylidene-1-phenyl-pyridazin-3-yl)oxypropanoate::butyl 2-(6-oxo-1-phenylpyridazin-3-yl)oxypropanoate::cid_4619761
SMILES CCCCOC(=O)C(C)Oc1ccc(=O)n(n1)-c1ccccc1
InChI Key InChIKey=GIYHMDZFNGPCET-UHFFFAOYSA-N
Data  2 EC50
  Tab Delimited (TSV)   2D SDfile   Computed 3D by Vconf -m prep SDfile
Find this compound or compounds like it in BindingDB:
Activity Spreadsheet -- Enzyme Inhibition Constant Data from BindingDB
Found 2 hits for monomerid = 39558
TargetIsoform 2 of Nuclear receptor ROR-alpha (Alpha-2)(Homo sapiens (Human))
The Scripps Research Institute Molecular Screening Center
Curated by PubChem BioAssay
LigandPNGBDBM39558(2-(6-keto-1-phenyl-pyridazin-3-yl)oxypropionic aci...)
Affinity DataEC50: >9.90E+4nM. Assay description: Source (MLSCN Center Name): The Scripps Research Institute Molecular Screening Center Center Affiliation: The Scripps Research Institute, TSRI Assay ...
Ligand InfoPC cidPC sid
In DepthDetails PCBioAssay
TargetSteroidogenic factor 1(Homo sapiens (Human))
The Scripps Research Institute Molecular Screening Center
Curated by PubChem BioAssay
LigandPNGBDBM39558(2-(6-keto-1-phenyl-pyridazin-3-yl)oxypropionic aci...)
Affinity DataEC50: >9.90E+4nM. Assay description: Source (MLSCN Center Name): The Scripps Research Institute Molecular Screening Center Center Affiliation: The Scripps Research Institute, TSRI Assay ...
Ligand InfoPC cidPC sid
In DepthDetails PCBioAssay