BDBM39560 1-(2-methoxy-4-methyl-5-propan-2-yl-phenyl)sulfonyl-4-methyl-imidazole::1-(2-methoxy-4-methyl-5-propan-2-ylphenyl)sulfonyl-4-methylimidazole::1-(5-isopropyl-2-methoxy-4-methyl-phenyl)sulfonyl-4-methyl-imidazole::MLS000114305::SMR000091715::cid_801592
SMILES COc1cc(C)c(cc1S(=O)(=O)n1cnc(C)c1)C(C)C
InChI Key InChIKey=JPQGNDCQMPXOGF-UHFFFAOYSA-N
Data  3 EC50
  Tab Delimited (TSV)   2D SDfile   Computed 3D by Vconf -m prep SDfile
Find this compound or compounds like it in BindingDB:
Activity Spreadsheet -- Enzyme Inhibition Constant Data from BindingDB
Found 3 hits for monomerid = 39560
TargetSteroidogenic factor 1(Homo sapiens (Human))
The Scripps Research Institute Molecular Screening Center
Curated by PubChem BioAssay
LigandPNGBDBM39560(1-(2-methoxy-4-methyl-5-propan-2-yl-phenyl)sulfony...)
Affinity DataEC50:  1.33E+3nM. Assay description: Source (MLSCN Center Name): The Scripps Research Institute Molecular Screening Center Center Affiliation: The Scripps Research Institute, TSRI Assay ...
In DepthDetails PCBioAssay
TargetVoltage-dependent T-type calcium channel subunit alpha-1H(Homo sapiens (Human))
Vanderbilt Screening Center For Gpcrs, Ion Channels And Transporters
Curated by PubChem BioAssay
LigandPNGBDBM39560(1-(2-methoxy-4-methyl-5-propan-2-yl-phenyl)sulfony...)
Affinity DataEC50:  5.23E+4nM. Assay description: Assay Provider: Xinmin Xie Assay Provider Affiliation: Bioscience Division, SRI International, Menlo Park, CA Grant Title: HTS Assay for Cav3 T-Type ...
In DepthDetails PCBioAssay
TargetIsoform 2 of Nuclear receptor ROR-alpha (Alpha-2)(Homo sapiens (Human))
The Scripps Research Institute Molecular Screening Center
Curated by PubChem BioAssay
LigandPNGBDBM39560(1-(2-methoxy-4-methyl-5-propan-2-yl-phenyl)sulfony...)
Affinity DataEC50:  1.85E+3nM. Assay description: Source (MLSCN Center Name): The Scripps Research Institute Molecular Screening Center Center Affiliation: The Scripps Research Institute, TSRI Assay ...
In DepthDetails PCBioAssay