BDBM39611 1-(2-keto-2-pyrrolidino-ethyl)-3-phenyl-thieno[3,2-d]pyrimidine-2,4-quinone::1-(2-oxidanylidene-2-pyrrolidin-1-yl-ethyl)-3-phenyl-thieno[3,2-d]pyrimidine-2,4-dione::1-(2-oxo-2-pyrrolidin-1-ylethyl)-3-phenylthieno[3,2-d]pyrimidine-2,4(1H,3H)-dione::1-(2-oxo-2-pyrrolidin-1-ylethyl)-3-phenylthieno[3,2-d]pyrimidine-2,4-dione::1-[2-oxo-2-(1-pyrrolidinyl)ethyl]-3-phenylthieno[3,2-d]pyrimidine-2,4-dione::MLS000087515::SMR000023738::cid_3236980
SMILES O=C(Cn1c2ccsc2c(=O)n(-c2ccccc2)c1=O)N1CCCC1
InChI Key InChIKey=HFAHKHKXCYGZLJ-UHFFFAOYSA-N
Data  2 IC50  1 EC50
  Tab Delimited (TSV)   2D SDfile   Computed 3D by Vconf -m prep SDfile
Find this compound or compounds like it in BindingDB:
Activity Spreadsheet -- Enzyme Inhibition Constant Data from BindingDB
Found 3 hits for monomerid = 39611
TargetAlkaline phosphatase, germ cell type(Homo sapiens (Human))
Burnham Center For Chemical Genomics
Curated by PubChem BioAssay
LigandPNGBDBM39611(1-(2-keto-2-pyrrolidino-ethyl)-3-phenyl-thieno[3,2...)
Affinity DataIC50:  9.99E+5nM. Assay description: Sanford-Burnham Center for Chemical Genomics (SBCCG) Sanford-Burnham Medical Research Institute (SBMRI, San Diego, CA) NIH Molecular Libraries Screen...
In DepthDetails PCBioAssay
TargetAlkaline phosphatase, germ cell type(Homo sapiens (Human))
Burnham Center For Chemical Genomics
Curated by PubChem BioAssay
LigandPNGBDBM39611(1-(2-keto-2-pyrrolidino-ethyl)-3-phenyl-thieno[3,2...)
Affinity DataEC50:  2.65E+3nM. Assay description: Sanford-Burnham Center for Chemical Genomics (SBCCG) Sanford-Burnham Medical Research Institute (SBMRI, San Diego, CA) NIH Molecular Libraries Screen...
In DepthDetails PCBioAssay
TargetInduced myeloid leukemia cell differentiation protein Mcl-1(Homo sapiens (Human))
Emory University
Curated by PubChem BioAssay
LigandPNGBDBM39611(1-(2-keto-2-pyrrolidino-ethyl)-3-phenyl-thieno[3,2...)
Affinity DataIC50:  1.16E+4nM. Assay description: NIH Molecular Libraries Screening Centers Network [MLSCN] Emory Chemical Biology Discovery Center in MLSCN Assay provider: Nikolovska-Coleska, Univer...
In DepthDetails PCBioAssay