BDBM39623 6-[(2-ethoxyphenoxy)methyl]-3-(4-methylphenyl)-[1,2,4]triazolo[3,4-b][1,3,4]thiadiazole::6-[(2-ethoxyphenoxy)methyl]-3-(4-methylphenyl)[1,2,4]triazolo[3,4-b][1,3,4]thiadiazole::6-[(2-ethoxyphenoxy)methyl]-3-(p-tolyl)-[1,2,4]triazolo[3,4-b][1,3,4]thiadiazole::MLS000052378::SMR000081729::cid_989979
SMILES CCOc1ccccc1OCc1nn2c(nnc2s1)-c1ccc(C)cc1
InChI Key InChIKey=DRIPDOQVYJJOEF-UHFFFAOYSA-N
Data  1 IC50  1 EC50
  Tab Delimited (TSV)   2D SDfile   Computed 3D by Vconf -m prep SDfile
Find this compound or compounds like it in BindingDB:
Activity Spreadsheet -- Enzyme Inhibition Constant Data from BindingDB
Found 2 hits for monomerid = 39623
TargetAlkaline phosphatase, germ cell type(Homo sapiens (Human))
Burnham Center For Chemical Genomics
Curated by PubChem BioAssay
LigandPNGBDBM39623(6-[(2-ethoxyphenoxy)methyl]-3-(4-methylphenyl)-[1,...)
Affinity DataEC50:  9.99E+5nM. Assay description: Sanford-Burnham Center for Chemical Genomics (SBCCG) Sanford-Burnham Medical Research Institute (SBMRI, San Diego, CA) NIH Molecular Libraries Screen...
In DepthDetails PCBioAssay
TargetAlkaline phosphatase, germ cell type(Homo sapiens (Human))
Burnham Center For Chemical Genomics
Curated by PubChem BioAssay
LigandPNGBDBM39623(6-[(2-ethoxyphenoxy)methyl]-3-(4-methylphenyl)-[1,...)
Affinity DataIC50:  5.58E+4nM. Assay description: Sanford-Burnham Center for Chemical Genomics (SBCCG) Sanford-Burnham Medical Research Institute (SBMRI, San Diego, CA) NIH Molecular Libraries Screen...
In DepthDetails PCBioAssay