BDBM396272 US10314827, Compound 21
SMILES C[C@@H]1[C@H]2[C@@H](C[C@H](C)CN2CCNC(C)=O)O[C@]11CC[C@H]2[C@@H]3CC[C@@H]4CC(=O)CC[C@]4(C)[C@H]3CC2=C(C)C1
InChI Key InChIKey=GGMVLAIKASDJJG-JBWPWPENSA-N
Data  1 EC50
  Tab Delimited (TSV)   2D SDfile   Computed 3D by Vconf -m prep SDfile
Find this compound or compounds like it in BindingDB:
Activity Spreadsheet -- Enzyme Inhibition Constant Data from BindingDB
Found 1 hit for monomerid = 396272
TargetAlkaline phosphatase, germ cell type(Homo sapiens (Human))
Infinity Pharmaceuticals
US Patent
LigandPNGBDBM396272(US10314827, Compound 21)
Affinity DataEC50:  60nM. Assay description: C3H10T1/2 cells were plated in 96 wells with a density of 8×103 cells/well. Cells were grown to confluence (72 hrs). After sonic Hedgehog (250 ng/ml)...
Ligand InfoPC cidPC sid
In DepthDetails US Patent