BDBM39640 2-Hydroxy-7,8,9-trimethyl-1H-thieno[2,3-b;4,5-b']dipyridin-4-one::MLS000067695::SMR000125074::cid_845675
SMILES Cc1nc2sc3c([nH]c(O)cc3=O)c2c(C)c1C
InChI Key InChIKey=OGRVZGBYHJPTOD-UHFFFAOYSA-N
Data  1 IC50  1 EC50
  Tab Delimited (TSV)   2D SDfile   Computed 3D by Vconf -m prep SDfile
Find this compound or compounds like it in BindingDB:
Activity Spreadsheet -- Enzyme Inhibition Constant Data from BindingDB
Found 2 hits for monomerid = 39640
TargetAlkaline phosphatase, germ cell type(Homo sapiens (Human))
Burnham Center For Chemical Genomics
Curated by PubChem BioAssay
LigandPNGBDBM39640(2-Hydroxy-7,8,9-trimethyl-1H-thieno[2,3-b;4,5-b...)
Affinity DataEC50:  9.99E+5nM. Assay description: Sanford-Burnham Center for Chemical Genomics (SBCCG) Sanford-Burnham Medical Research Institute (SBMRI, San Diego, CA) NIH Molecular Libraries Screen...
In DepthDetails PCBioAssay
TargetAlkaline phosphatase, germ cell type(Homo sapiens (Human))
Burnham Center For Chemical Genomics
Curated by PubChem BioAssay
LigandPNGBDBM39640(2-Hydroxy-7,8,9-trimethyl-1H-thieno[2,3-b;4,5-b...)
Affinity DataIC50:  9.99E+5nM. Assay description: Sanford-Burnham Center for Chemical Genomics (SBCCG) Sanford-Burnham Medical Research Institute (SBMRI, San Diego, CA) NIH Molecular Libraries Screen...
In DepthDetails PCBioAssay