BDBM39647 3-(4-chlorophenyl)-5-(4-methylphenyl)-4,5-dihydro-1H-pyridazin-6-one::3-(4-chlorophenyl)-5-(p-tolyl)-4,5-dihydro-1H-pyridazin-6-one::6-(4-chlorophenyl)-4-(4-methylphenyl)-4,5-dihydro-3(2H)-pyridazinone::MLS000540268::SMR000125526::cid_5182021
SMILES Cc1ccc(cc1)C1CC(=NNC1=O)c1ccc(Cl)cc1
InChI Key InChIKey=BCRGADIVYUGOKJ-UHFFFAOYSA-N
Data  1 IC50  1 EC50
  Tab Delimited (TSV)   2D SDfile   Computed 3D by Vconf -m prep SDfile
Find this compound or compounds like it in BindingDB:
Activity Spreadsheet -- Enzyme Inhibition Constant Data from BindingDB
Found 2 hits for monomerid = 39647
TargetAlkaline phosphatase, germ cell type(Homo sapiens (Human))
Burnham Center For Chemical Genomics
Curated by PubChem BioAssay
LigandPNGBDBM39647(3-(4-chlorophenyl)-5-(4-methylphenyl)-4,5-dihydro-...)
Affinity DataEC50:  203nM. Assay description: Sanford-Burnham Center for Chemical Genomics (SBCCG) Sanford-Burnham Medical Research Institute (SBMRI, San Diego, CA) NIH Molecular Libraries Screen...
In DepthDetails PCBioAssay
TargetAlkaline phosphatase, germ cell type(Homo sapiens (Human))
Burnham Center For Chemical Genomics
Curated by PubChem BioAssay
LigandPNGBDBM39647(3-(4-chlorophenyl)-5-(4-methylphenyl)-4,5-dihydro-...)
Affinity DataIC50:  9.99E+5nM. Assay description: Sanford-Burnham Center for Chemical Genomics (SBCCG) Sanford-Burnham Medical Research Institute (SBMRI, San Diego, CA) NIH Molecular Libraries Screen...
In DepthDetails PCBioAssay