BDBM39657 MLS000523074::N-(4-fluorobenzyl)-2-(2-keto-6-pyrrolidinosulfonyl-1,3-benzoxazol-3-yl)acetamide::N-[(4-fluorophenyl)methyl]-2-(2-oxidanylidene-6-pyrrolidin-1-ylsulfonyl-1,3-benzoxazol-3-yl)ethanamide::N-[(4-fluorophenyl)methyl]-2-(2-oxo-6-pyrrolidin-1-ylsulfonyl-1,3-benzoxazol-3-yl)acetamide::N-[(4-fluorophenyl)methyl]-2-[2-oxo-6-(1-pyrrolidinylsulfonyl)-1,3-benzoxazol-3-yl]acetamide::SMR000128339::cid_9550167
SMILES Fc1ccc(CNC(=O)Cn2c3ccc(cc3oc2=O)S(=O)(=O)N2CCCC2)cc1
InChI Key InChIKey=FSCMZNAQWXOIND-UHFFFAOYSA-N
Data  1 IC50  1 EC50
  Tab Delimited (TSV)   2D SDfile   Computed 3D by Vconf -m prep SDfile
Find this compound or compounds like it in BindingDB:
Activity Spreadsheet -- Enzyme Inhibition Constant Data from BindingDB
Found 2 hits for monomerid = 39657
TargetAlkaline phosphatase, germ cell type(Homo sapiens (Human))
Burnham Center For Chemical Genomics
Curated by PubChem BioAssay
LigandPNGBDBM39657(MLS000523074 | N-(4-fluorobenzyl)-2-(2-keto-6-pyrr...)
Affinity DataEC50:  457nM. Assay description: Sanford-Burnham Center for Chemical Genomics (SBCCG) Sanford-Burnham Medical Research Institute (SBMRI, San Diego, CA) NIH Molecular Libraries Screen...
In DepthDetails PCBioAssay
TargetAlkaline phosphatase, germ cell type(Homo sapiens (Human))
Burnham Center For Chemical Genomics
Curated by PubChem BioAssay
LigandPNGBDBM39657(MLS000523074 | N-(4-fluorobenzyl)-2-(2-keto-6-pyrr...)
Affinity DataIC50:  9.99E+5nM. Assay description: Sanford-Burnham Center for Chemical Genomics (SBCCG) Sanford-Burnham Medical Research Institute (SBMRI, San Diego, CA) NIH Molecular Libraries Screen...
In DepthDetails PCBioAssay