BDBM39664 (6-bromo-1-butyl-2,3-dihydropyrrolo[2,3-b]quinolin-4-yl)amine;hydrochloride::6-bromanyl-1-butyl-2,3-dihydropyrrolo[2,3-b]quinolin-4-amine;hydrochloride::6-bromo-1-butyl-2,3-dihydro-1H-pyrrolo[2,3-b]quinolin-4-amine hydrochloride::6-bromo-1-butyl-2,3-dihydropyrrolo[2,3-b]quinolin-4-amine;hydrochloride::MLS000532161::SMR000137102::cid_2831789
SMILES CCCCN1CCc2c1nc1ccc(Br)cc1c2N
InChI Key InChIKey=XHNLICSHYXRRRU-UHFFFAOYSA-N
Data  3 IC50  2 EC50
  Tab Delimited (TSV)   2D SDfile   Computed 3D by Vconf -m prep SDfile
Find this compound or compounds like it in BindingDB:
Activity Spreadsheet -- Enzyme Inhibition Constant Data from BindingDB
Found 5 hits for monomerid = 39664
TargetAlkaline phosphatase, germ cell type(Homo sapiens (Human))
Burnham Center For Chemical Genomics
Curated by PubChem BioAssay
LigandPNGBDBM39664((6-bromo-1-butyl-2,3-dihydropyrrolo[2,3-b]quinolin...)
Affinity DataIC50:  9.99E+5nM. Assay description: Sanford-Burnham Center for Chemical Genomics (SBCCG) Sanford-Burnham Medical Research Institute (SBMRI, San Diego, CA) NIH Molecular Libraries Screen...
In DepthDetails PCBioAssay
TargetAlkaline phosphatase, germ cell type(Homo sapiens (Human))
Burnham Center For Chemical Genomics
Curated by PubChem BioAssay
LigandPNGBDBM39664((6-bromo-1-butyl-2,3-dihydropyrrolo[2,3-b]quinolin...)
Affinity DataEC50:  7.72E+4nM. Assay description: Sanford-Burnham Center for Chemical Genomics (SBCCG) Sanford-Burnham Medical Research Institute (SBMRI, San Diego, CA) NIH Molecular Libraries Screen...
In DepthDetails PCBioAssay
TargetAcetylcholinesterase(Electrophorus electricus (Electric eel))
Nanjing University Of Chinese Medicine
Curated by ChEMBL
LigandPNGBDBM39664((6-bromo-1-butyl-2,3-dihydropyrrolo[2,3-b]quinolin...)
Affinity DataIC50:  300nM. Assay description: Inhibition of Electrophorus electricus AChE pre-incubated for 5 mins before acetylthiocholine iodide substrate addition by Ellman's method
In DepthDetails ArticlePubMed
TargetCholinesterase(Equus caballus (Horse))
Nanjing University Of Chinese Medicine
Curated by ChEMBL
LigandPNGBDBM39664((6-bromo-1-butyl-2,3-dihydropyrrolo[2,3-b]quinolin...)
Affinity DataIC50:  8.92E+3nM. Assay description: Inhibition of equine serum BChE pre-incubated for 5 mins before butyrylthiocholineiodide substrate addition by Ellman's method
In DepthDetails ArticlePubMed
TargetXylosyl- and glucuronyltransferase LARGE1(Homo sapiens (Human))
Burnham Center For Chemical Genomics
Curated by PubChem BioAssay
LigandPNGBDBM39664((6-bromo-1-butyl-2,3-dihydropyrrolo[2,3-b]quinolin...)
Affinity DataEC50: >8.00E+4nM
In DepthDetails PCBioAssay