BDBM397146 US10596172, Compound I-27::US10828300, Compound I-27::US11351168, Compound I-27::US9987276, Compound I-27
SMILES Cc1cnc(Nc2ccccc2)nc1NC1CCCN(C1)C(=O)C=C
InChI Key InChIKey=UOJJIRQZYSCCEU-UHFFFAOYSA-N
Data  15 IC50
  Tab Delimited (TSV)   2D SDfile   Computed 3D by Vconf -m prep SDfile
Find this compound or compounds like it in BindingDB:
Activity Spreadsheet -- Enzyme Inhibition Constant Data from BindingDB
Found 15 hits for monomerid = 397146
TargetCytoplasmic tyrosine-protein kinase BMX(Homo sapiens (Human))
Celgene Car
US Patent
LigandPNGBDBM397146(US10596172, Compound I-27 | US10828300, Compound I...)
Affinity DataIC50: <10nM. Assay description: BMX: The activity of selected compounds of this invention in the BMX inhibition assay
Ligand InfoPC cidPC sid
In DepthDetails US Patent
TargetTyrosine-protein kinase JAK3(Homo sapiens (Human))
Celgene Car
US Patent
LigandPNGBDBM397146(US10596172, Compound I-27 | US10828300, Compound I...)
Affinity DataIC50:  550nM. Assay description: Briefly, 10x stocks of EGFR-WT (PV3872) from Invitrogen and EGFR-T790M/L858R (40350) from BPS Bioscience, San Diego, Calif., 1.13×ATP (AS001A) and ap...
Ligand InfoPC cidPC sid
In DepthDetails US Patent
TargetTyrosine-protein kinase JAK3(Homo sapiens (Human))
Celgene Car
US Patent
LigandPNGBDBM397146(US10596172, Compound I-27 | US10828300, Compound I...)
Affinity DataIC50:  55nM. Assay description: JAK3: The Omnia Assay Protocol for potency assessment against JAK3 was performed in a substantially similar manner as that described in Example 251 a...
Ligand InfoPC cidPC sid
In DepthDetails US Patent
TargetTyrosine-protein kinase ITK/TSK(Homo sapiens (Human))
Celgene Car
US Patent
LigandPNGBDBM397146(US10596172, Compound I-27 | US10828300, Compound I...)
Affinity DataIC50:  55nM. Assay description: ITK: This example describes continuous-read kinase assays to measure inherent potency of compound against active forms of ITK enzymes as described in...
Ligand InfoPC cidPC sid
In DepthDetails US Patent
TargetTyrosine-protein kinase BTK(Homo sapiens (Human))
Celgene Car
US Patent
LigandPNGBDBM397146(US10596172, Compound I-27 | US10828300, Compound I...)
Affinity DataIC50: <10nM. Assay description: Briefly, 10× stocks of EGFR-WT (PV3872) from Invitrogen and EGFR-T790M/L858R (40350) from BPS Bioscience, San Diego, Calif., 1.13×ATP (AS001A) and ap...
Ligand InfoPC cidPC sid
In DepthDetails US Patent
TargetTyrosine-protein kinase ITK/TSK(Homo sapiens (Human))
Celgene Car
US Patent
LigandPNGBDBM397146(US10596172, Compound I-27 | US10828300, Compound I...)
Affinity DataIC50:  55nM. Assay description: Briefly, 10× stocks of EGFR-WT (PV3872) from Invitrogen and EGFR-T790M/L858R (40350) from BPS Bioscience, San Diego, Calif., 1.13×ATP (AS001A) and ap...
Ligand InfoPC cidPC sid
In DepthDetails US Patent
TargetCytoplasmic tyrosine-protein kinase BMX(Homo sapiens (Human))
Celgene Car
US Patent
LigandPNGBDBM397146(US10596172, Compound I-27 | US10828300, Compound I...)
Affinity DataIC50: <10nM. Assay description: Briefly, 10× stocks of EGFR-WT (PV3872) from Invitrogen and EGFR-T790M/L858R (40350) from BPS Bioscience, San Diego, Calif., 1.13×ATP (AS001A) and ap...
Ligand InfoPC cidPC sid
In DepthDetails US Patent
TargetEpidermal growth factor receptor(Homo sapiens (Human))
Celgene Car
US Patent
LigandPNGBDBM397146(US10596172, Compound I-27 | US10828300, Compound I...)
Affinity DataIC50:  55nM. Assay description: Briefly, 10× stocks of EGFR-WT (PV3872) from Invitrogen and EGFR-T790M/L858R (40350) from BPS Bioscience, San Diego, Calif., 1.13×ATP (AS001A) and ap...
Ligand InfoPC cidPC sid
In DepthDetails US Patent
TargetTyrosine-protein kinase JAK3(Homo sapiens (Human))
Celgene Car
US Patent
LigandPNGBDBM397146(US10596172, Compound I-27 | US10828300, Compound I...)
Affinity DataIC50:  55nM. Assay description: Briefly, 10× stocks of EGFR-WT (PV3872) from Invitrogen and EGFR-T790M/L858R (40350) from BPS Bioscience, San Diego, Calif., 1.13×ATP (AS001A) and ap...
Ligand InfoPC cidPC sid
In DepthDetails US Patent
TargetTyrosine-protein kinase BTK(Homo sapiens (Human))
Celgene Car
US Patent
LigandPNGBDBM397146(US10596172, Compound I-27 | US10828300, Compound I...)
Affinity DataIC50: <10nM. Assay description: Briefly, 10× stocks of EGFR-WT (PV3872) from Invitrogen and EGFR-T790M/L858R (40350) from BPS Bioscience, San Diego, Calif., 1.13×ATP (AS001A) and ap...
Ligand InfoPC cidPC sid
In DepthDetails US Patent
TargetTyrosine-protein kinase BTK(Homo sapiens (Human))
Celgene Car
US Patent
LigandPNGBDBM397146(US10596172, Compound I-27 | US10828300, Compound I...)
Affinity DataIC50: <100nM. Assay description: Briefly, 10x stocks of EGFR-WT (PV3872) from Invitrogen and EGFR-T790M/L858R (40350) from BPS Bioscience, San Diego, Calif., 1.13×ATP (AS001A) and ap...
Ligand InfoPC cidPC sid
In DepthDetails US Patent
TargetTyrosine-protein kinase ITK/TSK(Homo sapiens (Human))
Celgene Car
US Patent
LigandPNGBDBM397146(US10596172, Compound I-27 | US10828300, Compound I...)
Affinity DataIC50:  550nM. Assay description: Briefly, 10x stocks of EGFR-WT (PV3872) from Invitrogen and EGFR-T790M/L858R (40350) from BPS Bioscience, San Diego, Calif., 1.13×ATP (AS001A) and ap...
Ligand InfoPC cidPC sid
In DepthDetails US Patent
TargetCytoplasmic tyrosine-protein kinase BMX(Homo sapiens (Human))
Celgene Car
US Patent
LigandPNGBDBM397146(US10596172, Compound I-27 | US10828300, Compound I...)
Affinity DataIC50: <100nM. Assay description: Briefly, 10x stocks of EGFR-WT (PV3872) from Invitrogen and EGFR-T790M/L858R (40350) from BPS Bioscience, San Diego, Calif., 1.13×ATP (AS001A) and ap...
Ligand InfoPC cidPC sid
In DepthDetails US Patent
TargetEpidermal growth factor receptor(Homo sapiens (Human))
Celgene Car
US Patent
LigandPNGBDBM397146(US10596172, Compound I-27 | US10828300, Compound I...)
Affinity DataIC50:  550nM. Assay description: Briefly, 10x stocks of EGFR-WT (PV3872) from Invitrogen and EGFR-T790M/L858R (40350) from BPS Bioscience, San Diego, Calif., 1.13×ATP (AS001A) and ap...
Ligand InfoPC cidPC sid
In DepthDetails US Patent
TargetEpidermal growth factor receptor(Homo sapiens (Human))
Celgene Car
US Patent
LigandPNGBDBM397146(US10596172, Compound I-27 | US10828300, Compound I...)
Affinity DataIC50:  55nM. Assay description: EGFR (WT) and EGFR (T790M/L858R): The Omnia Assay Protocol for potency assessment against EGFR is performed as described in Example 251 above except ...
Ligand InfoPC cidPC sid
In DepthDetails US Patent