BDBM397334 US10596172, Compound I-161::US10828300, Compound I-161::US11351168, Compound I-161::US9987276, Compound I-161
SMILES OC(C(=C)C#N)c1ccc(Nc2nc(Nc3ccccc3)ncc2F)cc1
InChI Key InChIKey=FCKRSPPTGKYSKD-UHFFFAOYSA-N
Data  6 IC50
  Tab Delimited (TSV)   2D SDfile   Computed 3D by Vconf -m prep SDfile
Find this compound or compounds like it in BindingDB:
Activity Spreadsheet -- Enzyme Inhibition Constant Data from BindingDB
Found 6 hits for monomerid = 397334
TargetEpidermal growth factor receptor(Homo sapiens (Human))
Celgene Car
US Patent
LigandPNGBDBM397334(US10596172, Compound I-161 | US10828300, Compound ...)
Affinity DataIC50:  55nM. Assay description: EGFR (WT) and EGFR (T790M/L858R): The Omnia Assay Protocol for potency assessment against EGFR is performed as described in Example 251 above except ...
Ligand InfoPC cidPC sid
In DepthDetails US Patent
TargetTyrosine-protein kinase BTK(Homo sapiens (Human))
Celgene Car
US Patent
LigandPNGBDBM397334(US10596172, Compound I-161 | US10828300, Compound ...)
Affinity DataIC50: <10nM. Assay description: Briefly, 10× stocks of EGFR-WT (PV3872) from Invitrogen and EGFR-T790M/L858R (40350) from BPS Bioscience, San Diego, Calif., 1.13×ATP (AS001A) and ap...
Ligand InfoPC cidPC sid
In DepthDetails US Patent
TargetEpidermal growth factor receptor(Homo sapiens (Human))
Celgene Car
US Patent
LigandPNGBDBM397334(US10596172, Compound I-161 | US10828300, Compound ...)
Affinity DataIC50:  550nM. Assay description: Briefly, 10x stocks of EGFR-WT (PV3872) from Invitrogen and EGFR-T790M/L858R (40350) from BPS Bioscience, San Diego, Calif., 1.13×ATP (AS001A) and ap...
Ligand InfoPC cidPC sid
In DepthDetails US Patent
TargetTyrosine-protein kinase BTK(Homo sapiens (Human))
Celgene Car
US Patent
LigandPNGBDBM397334(US10596172, Compound I-161 | US10828300, Compound ...)
Affinity DataIC50: <10nM. Assay description: Briefly, 10× stocks of EGFR-WT (PV3872) from Invitrogen and EGFR-T790M/L858R (40350) from BPS Bioscience, San Diego, Calif., 1.13×ATP (AS001A) and ap...
Ligand InfoPC cidPC sid
In DepthDetails US Patent
TargetTyrosine-protein kinase BTK(Homo sapiens (Human))
Celgene Car
US Patent
LigandPNGBDBM397334(US10596172, Compound I-161 | US10828300, Compound ...)
Affinity DataIC50: <100nM. Assay description: Briefly, 10x stocks of EGFR-WT (PV3872) from Invitrogen and EGFR-T790M/L858R (40350) from BPS Bioscience, San Diego, Calif., 1.13×ATP (AS001A) and ap...
Ligand InfoPC cidPC sid
In DepthDetails US Patent
TargetEpidermal growth factor receptor(Homo sapiens (Human))
Celgene Car
US Patent
LigandPNGBDBM397334(US10596172, Compound I-161 | US10828300, Compound ...)
Affinity DataIC50:  55nM. Assay description: Briefly, 10× stocks of EGFR-WT (PV3872) from Invitrogen and EGFR-T790M/L858R (40350) from BPS Bioscience, San Diego, Calif., 1.13×ATP (AS001A) and ap...
Ligand InfoPC cidPC sid
In DepthDetails US Patent